{"text_format":"1","workbook":"xlsx","n_sheets":96,"sheets":["1.Kemzeke-Zuid","2.Halle-Dassenveld","3.Winksele","4.Herent","5.Bekkevoort","6.Overijse","7.St. Michiels","8.Izegem","9.Torhout","10.Houthalen","11.Diepenbeek","12.Wommelgem-Zuid","13.Minitaria","14.Hakendover","15.Kontich","16.Breendonk (Puurs)","17.Hasselt-Zuid","18.Herentals-West","19.Rumst","20.Paal","21.Lummen","22.Halen","23.Maasmechelen","24.Gentbrugge Arsenaal","25.Aalst-Zuid","26.Waasmunster","27.Melsele-Zuid","28.Meerbeke","29.Ninove","30.Kruishoutem","32.Vrasene-Noord","33.Merelbeke","34.Vilvoorde","35.Holsbeek","36.Halle-Essenbeek","37.Halle-Sint Rochus","38.Boutersem","39.Aarschot","40.Tielt-Winge","41.Walshoutem","42.Zingem","43.Kemzeke-West","44.Kemzeke-Oost","45.Wommelgem-Noord","47.Lille","48.Oelegem-West","49.Oelegem-Oost","50.Sint Job in 't Goor","51.Menen","52.Deerlijk","53.Zoersel","54.E17 Deinze","55.Erpe-Mere","56.Geel-West","57.Veurne","58.Oudenburg","59.Middelkerke","60.Loenhout","61.Meise","62.Nieuwpoort","63.Lichtervelde","64.Kortrijk-Oost","65.Loppem","66.Jabbeke-Oost","67.Waregem","68.Zandvoorde","69.Beernem","70.The Loop-Expo","72.Veurne","73.Jabbeke-West","74.Melsele","76.Wuustwezel","77.Keizershoek","78.Blancefloerlaan","81.Rotselaar","82.Vuntcomplex","83.Sterrebeek","84.Halle-Rattenput","85.Strombeek-Bever","86.Jezus-Eik","87.Affligem","88.Bertem","89.Hoegaarden","90.Kampenhout","91.Nevele","92.Beerse-Vosselaar","93.Terlaemen","94.Boechout","95.Aalter","96.De Pinte","97.Destelbergen","98.Lokeren","99.Massenhoven","100.Tongeren","Coordinaten","Sjabloon"],"not_rendered":{"charts":190,"images":95,"macros":1,"external_links":0,"defined_names":190,"comments":0,"pivot_tables":0},"unopened":[],"bounds":{"document_bytes":16777216,"sheet_cells":100000,"rows_first":2000,"rows_last":500,"rows_between":2000,"halvings":0,"cell_chars":16384,"cell_head_chars":4096},"cells_cut":0,"cells_raw":0,"read":"whole","date_system":"1900"}

{"sheet":"1.Kemzeke-Zuid","index":0,"n_rows":57,"n_cols":26,"rows_kept":57,"cut":false,"hidden":false,"merged":[[4,3,5,12],[4,16,5,16],[15,3,16,12]]}
[]
[null,"PARKEERONDERZOEK",null,"CARPOOLPARKINGS EN P+R PARKINGS"]
[null,1,null,{"$f":"B8 & \" - \"& TEXT(VLOOKUP(B3,Coordinaten!$A$2:$G$95,7,0),\"dddd dd mmmm jjjj\")","v":"Carpool parking Kemzeke-Zuid, Stekene - dinsdag 09 november 2021"}]
[null,{"$f":"VLOOKUP(B3,Coordinaten!$A$2:$G$95,6,0)","v":"51.226907, 4.063425"}]
[null,null,null,"BEZETTING  ",null,null,null,null,null,null,null,null,null,null,null,null,"OPMERKINGEN"]
[]
[null,"Onderzoeksgebied",null,"Datum","Geregistreerd tussen","Pers","Vracht","Motor","Obstakel / overig","Fout   pers","Fout Vracht","Totaal","E-wagen\nplaats","Invalidenplaats","Gestalde fietsen",null,null,null,null,null,{"$f":"F7","v":"Pers"},"Vracht","Motor","Obstakel / overig","Fout   pers","Fout Vracht"]
[null,{"$f":"VLOOKUP(B3,Coordinaten!$A$2:$G$95,3,0)&\", \"&VLOOKUP(B3,Coordinaten!$A$2:$G$95,5,0)","v":"Carpool parking Kemzeke-Zuid, Stekene"},null,"2021-11-09","09:00 - 16:00u",40,1,0,0,17,0,58,0,0,5,null,0,null,{"$f":"D8","v":"2021-11-09"},{"$f":"E8","v":"09:00 - 16:00u"},{"$f":"IF(F8=0,NA(),F8/$L8)","v":0.68965517241379315},{"$f":"IF(G8=0,NA(),G8/$L8)","v":1.7241379310344827E-2},{"$f":"IF(H8=0,NA(),H8/$L8)","v":{"$error":"#N/A"}},{"$error":"#N/A"},0.29310344827586204,{"$error":"#N/A"}]
[null,{"$f":"\"Nabij kruispunt: \"&VLOOKUP(B3,Coordinaten!$A$2:$L$95,4,0)","v":"Nabij kruispunt: N49 / N403"},null,null,null,0.68965517241379315,1.7241379310344827E-2,"-","-",0.29310344827586204,"-",1,null,null,null,null,0,null,{"$f":"D10","v":"2021-11-09"},{"$f":"E10","v":"19:00 - 02:00u"},{"$f":"IF(F10=0,NA(),F10/$L10)","v":0.6},{"$f":"IF(G10=0,NA(),G10/$L10)","v":0.25},{"$error":"#N/A"},{"$error":"#N/A"},{"$error":"#N/A"},0.15]
[null,null,null,"2021-11-09","19:00 - 02:00u",12,5,0,0,0,3,20,0,0,4,null,0]
[null,"Meting",null,null,null,0.6,0.25,"-","-","-",0.15,1,null,null,null,null,0]
[null,{"$f":"\"Meetperiode: \"&TEXT(VLOOKUP(B3,Coordinaten!$A$2:$G$95,7,0),\"dddd d mmmm jjjj\")","v":"Meetperiode: dinsdag 9 november 2021"}]
[null,"Methodiek: Parkeerdrukmeting met waarnemers"]
[null,"In opdracht van: Vlaamse overheid"]
[null,"Uitgevoerd door: Dufec"]
[null,null,null,"VERDELING NAAR CATEGORIE"]
[null,"Locatie"]
[null,{"$f":"IF(B4=\"\",\"\",HYPERLINK(\"http://www.googlemaps.com/?q=\"&B4,\"Lat/Long: \"&B4))","v":"Lat/Long: 51.226907, 4.063425"}]
[]
[null,null,null,null,null,null,null,null,null,null,null,null,null,null,null,"Legenda"]
[null,null,null,null,null,null,null,null,null,null,null,null,null,null,null,null,"Personenwagen"]
[null,null,null,null,null,null,null,null,null,null,null,null,null,null,null,null,"Vracht"]
[null,null,null,null,null,null,null,null,null,null,null,null,null,null,null,null,"Motor"]
[null,null,null,null,null,null,null,null,null,null,null,null,null,null,null,null,"Obstakel / overig"]
[null,null,null,null,null,null,null,null,null,null,null,null,null,null,null,null,"Fout personenwagen"]
[null,null,null,null,null,null,null,null,null,null,null,null,null,null,null,null,"Fout Vracht"]
[]
[]
[]
[]
[]
[]
[]
[]
[]
[]
[]
[null,"Opmerking"]
[null,"Het onderzoek vindt plaats gedurende coronamaatregelen."]
[null,"Dit heeft mogelijk een effect op de resultaten."]
[]
[null,"Toelichting"]
[null,"Pers = personenwagens op daarvoor bestemde"]
[null,"          openbare plaatsen"]
[null,"Vracht = vrachtwagens op daarvoor bestemde"]
[null,"          parkeerplaatsen (middel- en zwaar vrachtverkeer)"]
[null,"Motor = geparkeerde motoren op openbare plaatsen"]
[null,"Obstakel / overig = obstakels of overige voertuigen"]
[null,"          geparkeerd op openbare plaatsen"]
[null,"Fout pers = personenwagens die fout geparkeerd staan"]
[null,"Fout vracht = vrachtwagens die fout geparkeerd staan"]
[null,"E-wagen = geparkeerde elektrisch voertuig bij een"]
[null,"          elektrisch oplaadpunt"]
[null,"Invalide = personenwagens en motoren op voor"]
[null,"          invalide personen bestemde parkeerplaats"]
[null,"Gestalde fietsen = alle gestalde fietsen op de"]
[null,"          daarvoor bestemde parkeerplaatsen"]

{"sheet":"2.Halle-Dassenveld","index":1,"n_rows":57,"n_cols":26,"rows_kept":57,"cut":false,"hidden":false,"merged":[[53,3,56,14],[4,3,5,12],[4,16,5,16],[15,3,16,12]]}
[]
[null,"PARKEERONDERZOEK",null,"CARPOOLPARKINGS EN P+R PARKINGS"]
[null,2,null,{"$f":"B8 & \" - \"& TEXT(VLOOKUP(B3,Coordinaten!$A$2:$G$95,7,0),\"dddd dd mmmm jjjj\")","v":"Carpool parking Halle-Dassenveld, Halle - dinsdag 23 november 2021"}]
[null,{"$f":"VLOOKUP(B3,Coordinaten!$A$2:$G$95,6,0)","v":"50.726346, 4.217220"}]
[null,null,null,"BEZETTING  ",null,null,null,null,null,null,null,null,null,null,null,null,"OPMERKINGEN"]
[]
[null,"Onderzoeksgebied",null,"Datum","Geregistreerd tussen","Pers","Vracht","Motor","Obstakel / overig","Fout   pers","Fout Vracht","Totaal","E-wagen\nplaats","Invalidenplaats","Gestalde fietsen",null,null,null,null,null,{"$f":"F7","v":"Pers"},"Vracht","Motor","Obstakel / overig","Fout   pers","Fout Vracht"]
[null,{"$f":"VLOOKUP(B3,Coordinaten!$A$2:$G$95,3,0)&\", \"&VLOOKUP(B3,Coordinaten!$A$2:$G$95,5,0)","v":"Carpool parking Halle-Dassenveld, Halle"},null,"2021-11-23","09:00 - 16:00u",44,0,0,0,0,10,54,0,0,0,null,"Vanaf 20 november nieuwe coronamaatregelen, waaronder verplicht telewerk",null,{"$f":"D8","v":"2021-11-23"},{"$f":"E8","v":"09:00 - 16:00u"},{"$f":"IF(F8=0,NA(),F8/$L8)","v":0.81481481481481477},{"$f":"IF(G8=0,NA(),G8/$L8)","v":{"$error":"#N/A"}},{"$f":"IF(H8=0,NA(),H8/$L8)","v":{"$error":"#N/A"}},{"$error":"#N/A"},{"$error":"#N/A"},0.18518518518518517]
[null,{"$f":"\"Nabij kruispunt: \"&VLOOKUP(B3,Coordinaten!$A$2:$L$95,4,0)","v":"Nabij kruispunt: N7 / A8"},null,null,null,0.81481481481481477,"-","-","-","-",0.18518518518518517,1,null,null,null,null,0,null,{"$f":"D10","v":"2021-11-23"},{"$f":"E10","v":"19:00 - 02:00u"},{"$f":"IF(F10=0,NA(),F10/$L10)","v":0.42857142857142855},{"$f":"IF(G10=0,NA(),G10/$L10)","v":{"$error":"#N/A"}},{"$error":"#N/A"},{"$error":"#N/A"},{"$error":"#N/A"},0.5714285714285714]
[null,null,null,"2021-11-23","19:00 - 02:00u",15,0,0,0,0,20,35,0,2,0,null,"Vanaf 20 november nieuwe coronamaatregelen, waaronder verplicht telewerk"]
[null,"Meting",null,null,null,0.42857142857142855,"-","-","-","-",0.5714285714285714,1,null,null,null,null,0]
[null,{"$f":"\"Meetperiode: \"&TEXT(VLOOKUP(B3,Coordinaten!$A$2:$G$95,7,0),\"dddd d mmmm jjjj\")","v":"Meetperiode: dinsdag 23 november 2021"}]
[null,"Methodiek: Parkeerdrukmeting met waarnemers"]
[null,"In opdracht van: Vlaamse overheid"]
[null,"Uitgevoerd door: Dufec"]
[null,null,null,"VERDELING NAAR CATEGORIE"]
[null,"Locatie"]
[null,{"$f":"IF(B4=\"\",\"\",HYPERLINK(\"http://www.googlemaps.com/?q=\"&B4,\"Lat/Long: \"&B4))","v":"Lat/Long: 50.726346, 4.217220"}]
[]
[null,null,null,null,null,null,null,null,null,null,null,null,null,null,null,"Legenda"]
[null,null,null,null,null,null,null,null,null,null,null,null,null,null,null,null,"Personenwagen"]
[null,null,null,null,null,null,null,null,null,null,null,null,null,null,null,null,"Vracht"]
[null,null,null,null,null,null,null,null,null,null,null,null,null,null,null,null,"Motor"]
[null,null,null,null,null,null,null,null,null,null,null,null,null,null,null,null,"Obstakel / overig"]
[null,null,null,null,null,null,null,null,null,null,null,null,null,null,null,null,"Fout personenwagen"]
[null,null,null,null,null,null,null,null,null,null,null,null,null,null,null,null,"Fout Vracht"]
[]
[]
[]
[]
[]
[]
[]
[]
[]
[]
[]
[null,"Opmerking"]
[null,"Het onderzoek vindt plaats gedurende coronamaatregelen."]
[null,"Dit heeft mogelijk een effect op de resultaten."]
[]
[null,"Toelichting"]
[null,"Pers = personenwagens op daarvoor bestemde"]
[null,"          openbare plaatsen"]
[null,"Vracht = vrachtwagens op daarvoor bestemde"]
[null,"          parkeerplaatsen (middel- en zwaar vrachtverkeer)"]
[null,"Motor = geparkeerde motoren op openbare plaatsen"]
[null,"Obstakel / overig = obstakels of overige voertuigen"]
[null,"          geparkeerd op openbare plaatsen"]
[null,"Fout pers = personenwagens die fout geparkeerd staan"]
[null,"Fout vracht = vrachtwagens die fout geparkeerd staan"]
[null,"E-wagen = geparkeerde elektrisch voertuig bij een"]
[null,"          elektrisch oplaadpunt"]
[null,"Invalide = personenwagens en motoren op voor"]
[null,"          invalide personen bestemde parkeerplaats"]
[null,"Gestalde fietsen = alle gestalde fietsen op de"]
[null,"          daarvoor bestemde parkeerplaatsen"]

{"sheet":"3.Winksele","index":2,"n_rows":57,"n_cols":26,"rows_kept":57,"cut":false,"hidden":false,"merged":[[4,3,5,12],[4,16,5,16],[15,3,16,12]]}
[]
[null,"PARKEERONDERZOEK",null,"CARPOOLPARKINGS EN P+R PARKINGS"]
[null,3,null,{"$f":"B8 & \" - \"& TEXT(VLOOKUP(B3,Coordinaten!$A$2:$G$95,7,0),\"dddd dd mmmm jjjj\")","v":"Carpool parking Winksele, Herent - dinsdag 16 november 2021"}]
[null,{"$f":"VLOOKUP(B3,Coordinaten!$A$2:$G$95,6,0)","v":"50.885324, 4.672071"}]
[null,null,null,"BEZETTING  ",null,null,null,null,null,null,null,null,null,null,null,null,"OPMERKINGEN"]
[]
[null,"Onderzoeksgebied",null,"Datum","Geregistreerd tussen","Pers","Vracht","Motor","Obstakel / overig","Fout   pers","Fout Vracht","Totaal","E-wagen\nplaats","Invalidenplaats","Gestalde fietsen",null,null,null,null,null,{"$f":"F7","v":"Pers"},"Vracht","Motor","Obstakel / overig","Fout   pers","Fout Vracht"]
[null,{"$f":"VLOOKUP(B3,Coordinaten!$A$2:$G$95,3,0)&\", \"&VLOOKUP(B3,Coordinaten!$A$2:$G$95,5,0)","v":"Carpool parking Winksele, Herent"},null,"2021-11-16","09:00 - 16:00u",11,0,0,0,0,0,11,0,0,2,null,0,null,{"$f":"D8","v":"2021-11-16"},{"$f":"E8","v":"09:00 - 16:00u"},{"$f":"IF(F8=0,NA(),F8/$L8)","v":1},{"$f":"IF(G8=0,NA(),G8/$L8)","v":{"$error":"#N/A"}},{"$f":"IF(H8=0,NA(),H8/$L8)","v":{"$error":"#N/A"}},{"$error":"#N/A"},{"$error":"#N/A"},{"$error":"#N/A"}]
[null,{"$f":"\"Nabij kruispunt: \"&VLOOKUP(B3,Coordinaten!$A$2:$L$95,4,0)","v":"Nabij kruispunt: Stuiverstraat / N2"},null,null,null,1,"-","-","-","-","-",1,null,null,null,null,0,null,{"$f":"D10","v":"2021-11-16"},{"$f":"E10","v":"19:00 - 02:00u"},{"$f":"IF(F10=0,NA(),F10/$L10)","v":1},{"$f":"IF(G10=0,NA(),G10/$L10)","v":{"$error":"#N/A"}},{"$error":"#N/A"},{"$error":"#N/A"},{"$error":"#N/A"},{"$error":"#N/A"}]
[null,null,null,"2021-11-16","19:00 - 02:00u",4,0,0,0,0,0,4,0,0,2,null,0]
[null,"Meting",null,null,null,1,"-","-","-","-","-",1,null,null,null,null,0]
[null,{"$f":"\"Meetperiode: \"&TEXT(VLOOKUP(B3,Coordinaten!$A$2:$G$95,7,0),\"dddd d mmmm jjjj\")","v":"Meetperiode: dinsdag 16 november 2021"}]
[null,"Methodiek: Parkeerdrukmeting met waarnemers"]
[null,"In opdracht van: Vlaamse overheid"]
[null,"Uitgevoerd door: Dufec"]
[null,null,null,"VERDELING NAAR CATEGORIE"]
[null,"Locatie"]
[null,{"$f":"IF(B4=\"\",\"\",HYPERLINK(\"http://www.googlemaps.com/?q=\"&B4,\"Lat/Long: \"&B4))","v":"Lat/Long: 50.885324, 4.672071"}]
[]
[null,null,null,null,null,null,null,null,null,null,null,null,null,null,null,"Legenda"]
[null,null,null,null,null,null,null,null,null,null,null,null,null,null,null,null,"Personenwagen"]
[null,null,null,null,null,null,null,null,null,null,null,null,null,null,null,null,"Vracht"]
[null,null,null,null,null,null,null,null,null,null,null,null,null,null,null,null,"Motor"]
[null,null,null,null,null,null,null,null,null,null,null,null,null,null,null,null,"Obstakel / overig"]
[null,null,null,null,null,null,null,null,null,null,null,null,null,null,null,null,"Fout personenwagen"]
[null,null,null,null,null,null,null,null,null,null,null,null,null,null,null,null,"Fout Vracht"]
[]
[]
[]
[]
[]
[]
[]
[]
[]
[]
[]
[null,"Opmerking"]
[null,"Het onderzoek vindt plaats gedurende coronamaatregelen."]
[null,"Dit heeft mogelijk een effect op de resultaten."]
[]
[null,"Toelichting"]
[null,"Pers = personenwagens op daarvoor bestemde"]
[null,"          openbare plaatsen"]
[null,"Vracht = vrachtwagens op daarvoor bestemde"]
[null,"          parkeerplaatsen (middel- en zwaar vrachtverkeer)"]
[null,"Motor = geparkeerde motoren op openbare plaatsen"]
[null,"Obstakel / overig = obstakels of overige voertuigen"]
[null,"          geparkeerd op openbare plaatsen"]
[null,"Fout pers = personenwagens die fout geparkeerd staan"]
[null,"Fout vracht = vrachtwagens die fout geparkeerd staan"]
[null,"E-wagen = geparkeerde elektrisch voertuig bij een"]
[null,"          elektrisch oplaadpunt"]
[null,"Invalide = personenwagens en motoren op voor"]
[null,"          invalide personen bestemde parkeerplaats"]
[null,"Gestalde fietsen = alle gestalde fietsen op de"]
[null,"          daarvoor bestemde parkeerplaatsen"]

{"sheet":"4.Herent","index":3,"n_rows":57,"n_cols":26,"rows_kept":57,"cut":false,"hidden":false,"merged":[[4,3,5,12],[4,16,5,16],[15,3,16,12]]}
[]
[null,"PARKEERONDERZOEK",null,"CARPOOLPARKINGS EN P+R PARKINGS"]
[null,4,null,{"$f":"B8 & \" - \"& TEXT(VLOOKUP(B3,Coordinaten!$A$2:$G$95,7,0),\"dddd dd mmmm jjjj\")","v":"Carpool parking Herent, Leuven - dinsdag 16 november 2021"}]
[null,{"$f":"VLOOKUP(B3,Coordinaten!$A$2:$G$95,6,0)","v":"50.893869, 4.689409"}]
[null,null,null,"BEZETTING  ",null,null,null,null,null,null,null,null,null,null,null,null,"OPMERKINGEN"]
[]
[null,"Onderzoeksgebied",null,"Datum","Geregistreerd tussen","Pers","Vracht","Motor","Obstakel / overig","Fout   pers","Fout Vracht","Totaal","E-wagen\nplaats","Invalidenplaats","Gestalde fietsen",null,null,null,null,null,{"$f":"F7","v":"Pers"},"Vracht","Motor","Obstakel / overig","Fout   pers","Fout Vracht"]
[null,{"$f":"VLOOKUP(B3,Coordinaten!$A$2:$G$95,3,0)&\", \"&VLOOKUP(B3,Coordinaten!$A$2:$G$95,5,0)","v":"Carpool parking Herent, Leuven"},null,"2021-11-16","09:00 - 16:00u",45,0,0,1,0,0,46,0,0,14,null,"Obstakel: aanhanger",null,{"$f":"D8","v":"2021-11-16"},{"$f":"E8","v":"09:00 - 16:00u"},{"$f":"IF(F8=0,NA(),F8/$L8)","v":0.97826086956521741},{"$f":"IF(G8=0,NA(),G8/$L8)","v":{"$error":"#N/A"}},{"$f":"IF(H8=0,NA(),H8/$L8)","v":{"$error":"#N/A"}},2.1739130434782608E-2,{"$error":"#N/A"},{"$error":"#N/A"}]
[null,{"$f":"\"Nabij kruispunt: \"&VLOOKUP(B3,Coordinaten!$A$2:$L$95,4,0)","v":"Nabij kruispunt: N26 / A2"},null,null,null,0.97826086956521741,"-","-",2.1739130434782608E-2,"-","-",1,null,null,null,null,0,null,{"$f":"D10","v":"2021-11-16"},{"$f":"E10","v":"19:00 - 02:00u"},{"$f":"IF(F10=0,NA(),F10/$L10)","v":0.95918367346938771},{"$f":"IF(G10=0,NA(),G10/$L10)","v":{"$error":"#N/A"}},{"$error":"#N/A"},{"$error":"#N/A"},{"$error":"#N/A"},4.0816326530612242E-2]
[null,null,null,"2021-11-16","19:00 - 02:00u",47,0,0,0,0,2,49,0,0,0,null,0]
[null,"Meting",null,null,null,0.95918367346938771,"-","-","-","-",4.0816326530612242E-2,1,null,null,null,null,0]
[null,{"$f":"\"Meetperiode: \"&TEXT(VLOOKUP(B3,Coordinaten!$A$2:$G$95,7,0),\"dddd d mmmm jjjj\")","v":"Meetperiode: dinsdag 16 november 2021"}]
[null,"Methodiek: Parkeerdrukmeting met waarnemers"]
[null,"In opdracht van: Vlaamse overheid"]
[null,"Uitgevoerd door: Dufec"]
[null,null,null,"VERDELING NAAR CATEGORIE"]
[null,"Locatie"]
[null,{"$f":"IF(B4=\"\",\"\",HYPERLINK(\"http://www.googlemaps.com/?q=\"&B4,\"Lat/Long: \"&B4))","v":"Lat/Long: 50.893869, 4.689409"}]
[]
[null,null,null,null,null,null,null,null,null,null,null,null,null,null,null,"Legenda"]
[null,null,null,null,null,null,null,null,null,null,null,null,null,null,null,null,"Personenwagen"]
[null,null,null,null,null,null,null,null,null,null,null,null,null,null,null,null,"Vracht"]
[null,null,null,null,null,null,null,null,null,null,null,null,null,null,null,null,"Motor"]
[null,null,null,null,null,null,null,null,null,null,null,null,null,null,null,null,"Obstakel / overig"]
[null,null,null,null,null,null,null,null,null,null,null,null,null,null,null,null,"Fout personenwagen"]
[null,null,null,null,null,null,null,null,null,null,null,null,null,null,null,null,"Fout Vracht"]
[]
[]
[]
[]
[]
[]
[]
[]
[]
[]
[]
[null,"Opmerking"]
[null,"Het onderzoek vindt plaats gedurende coronamaatregelen."]
[null,"Dit heeft mogelijk een effect op de resultaten."]
[]
[null,"Toelichting"]
[null,"Pers = personenwagens op daarvoor bestemde"]
[null,"          openbare plaatsen"]
[null,"Vracht = vrachtwagens op daarvoor bestemde"]
[null,"          parkeerplaatsen (middel- en zwaar vrachtverkeer)"]
[null,"Motor = geparkeerde motoren op openbare plaatsen"]
[null,"Obstakel / overig = obstakels of overige voertuigen"]
[null,"          geparkeerd op openbare plaatsen"]
[null,"Fout pers = personenwagens die fout geparkeerd staan"]
[null,"Fout vracht = vrachtwagens die fout geparkeerd staan"]
[null,"E-wagen = geparkeerde elektrisch voertuig bij een"]
[null,"          elektrisch oplaadpunt"]
[null,"Invalide = personenwagens en motoren op voor"]
[null,"          invalide personen bestemde parkeerplaats"]
[null,"Gestalde fietsen = alle gestalde fietsen op de"]
[null,"          daarvoor bestemde parkeerplaatsen"]

{"sheet":"5.Bekkevoort","index":4,"n_rows":57,"n_cols":26,"rows_kept":57,"cut":false,"hidden":false,"merged":[[4,3,5,12],[4,16,5,16],[15,3,16,12]]}
[]
[null,"PARKEERONDERZOEK",null,"CARPOOLPARKINGS EN P+R PARKINGS"]
[null,5,null,{"$f":"B8 & \" - \"& TEXT(VLOOKUP(B3,Coordinaten!$A$2:$G$95,7,0),\"dddd dd mmmm jjjj\")","v":"Carpool parking Bekkevoort, Bekkevoort - dinsdag 16 november 2021"}]
[null,{"$f":"VLOOKUP(B3,Coordinaten!$A$2:$G$95,6,0)","v":"50.952219, 4.998683"}]
[null,null,null,"BEZETTING  ",null,null,null,null,null,null,null,null,null,null,null,null,"OPMERKINGEN"]
[]
[null,"Onderzoeksgebied",null,"Datum","Geregistreerd tussen","Pers","Vracht","Motor","Obstakel / overig","Fout   pers","Fout Vracht","Totaal","E-wagen\nplaats","Invalidenplaats","Gestalde fietsen",null,null,null,null,null,{"$f":"F7","v":"Pers"},"Vracht","Motor","Obstakel / overig","Fout   pers","Fout Vracht"]
[null,{"$f":"VLOOKUP(B3,Coordinaten!$A$2:$G$95,3,0)&\", \"&VLOOKUP(B3,Coordinaten!$A$2:$G$95,5,0)","v":"Carpool parking Bekkevoort, Bekkevoort"},null,"2021-11-16","09:00 - 16:00u",29,0,0,0,0,0,29,0,0,1,null,0,null,{"$f":"D8","v":"2021-11-16"},{"$f":"E8","v":"09:00 - 16:00u"},{"$f":"IF(F8=0,NA(),F8/$L8)","v":1},{"$f":"IF(G8=0,NA(),G8/$L8)","v":{"$error":"#N/A"}},{"$f":"IF(H8=0,NA(),H8/$L8)","v":{"$error":"#N/A"}},{"$error":"#N/A"},{"$error":"#N/A"},{"$error":"#N/A"}]
[null,{"$f":"\"Nabij kruispunt: \"&VLOOKUP(B3,Coordinaten!$A$2:$L$95,4,0)","v":"Nabij kruispunt: N2 / A2"},null,null,null,1,"-","-","-","-","-",1,null,null,null,null,0,null,{"$f":"D10","v":"2021-11-16"},{"$f":"E10","v":"19:00 - 02:00u"},{"$f":"IF(F10=0,NA(),F10/$L10)","v":1},{"$f":"IF(G10=0,NA(),G10/$L10)","v":{"$error":"#N/A"}},{"$error":"#N/A"},{"$error":"#N/A"},{"$error":"#N/A"},{"$error":"#N/A"}]
[null,null,null,"2021-11-16","19:00 - 02:00u",11,0,0,0,0,0,11,0,0,0,null,0]
[null,"Meting",null,null,null,1,"-","-","-","-","-",1,null,null,null,null,0]
[null,{"$f":"\"Meetperiode: \"&TEXT(VLOOKUP(B3,Coordinaten!$A$2:$G$95,7,0),\"dddd d mmmm jjjj\")","v":"Meetperiode: dinsdag 16 november 2021"}]
[null,"Methodiek: Parkeerdrukmeting met waarnemers"]
[null,"In opdracht van: Vlaamse overheid"]
[null,"Uitgevoerd door: Dufec"]
[null,null,null,"VERDELING NAAR CATEGORIE"]
[null,"Locatie"]
[null,{"$f":"IF(B4=\"\",\"\",HYPERLINK(\"http://www.googlemaps.com/?q=\"&B4,\"Lat/Long: \"&B4))","v":"Lat/Long: 50.952219, 4.998683"}]
[]
[null,null,null,null,null,null,null,null,null,null,null,null,null,null,null,"Legenda"]
[null,null,null,null,null,null,null,null,null,null,null,null,null,null,null,null,"Personenwagen"]
[null,null,null,null,null,null,null,null,null,null,null,null,null,null,null,null,"Vracht"]
[null,null,null,null,null,null,null,null,null,null,null,null,null,null,null,null,"Motor"]
[null,null,null,null,null,null,null,null,null,null,null,null,null,null,null,null,"Obstakel / overig"]
[null,null,null,null,null,null,null,null,null,null,null,null,null,null,null,null,"Fout personenwagen"]
[null,null,null,null,null,null,null,null,null,null,null,null,null,null,null,null,"Fout Vracht"]
[]
[]
[]
[]
[]
[]
[]
[]
[]
[]
[]
[null,"Opmerking"]
[null,"Het onderzoek vindt plaats gedurende coronamaatregelen."]
[null,"Dit heeft mogelijk een effect op de resultaten."]
[]
[null,"Toelichting"]
[null,"Pers = personenwagens op daarvoor bestemde"]
[null,"          openbare plaatsen"]
[null,"Vracht = vrachtwagens op daarvoor bestemde"]
[null,"          parkeerplaatsen (middel- en zwaar vrachtverkeer)"]
[null,"Motor = geparkeerde motoren op openbare plaatsen"]
[null,"Obstakel / overig = obstakels of overige voertuigen"]
[null,"          geparkeerd op openbare plaatsen"]
[null,"Fout pers = personenwagens die fout geparkeerd staan"]
[null,"Fout vracht = vrachtwagens die fout geparkeerd staan"]
[null,"E-wagen = geparkeerde elektrisch voertuig bij een"]
[null,"          elektrisch oplaadpunt"]
[null,"Invalide = personenwagens en motoren op voor"]
[null,"          invalide personen bestemde parkeerplaats"]
[null,"Gestalde fietsen = alle gestalde fietsen op de"]
[null,"          daarvoor bestemde parkeerplaatsen"]

{"sheet":"6.Overijse","index":5,"n_rows":57,"n_cols":26,"rows_kept":57,"cut":false,"hidden":false,"merged":[[4,3,5,12],[4,16,5,16],[15,3,16,12]]}
[]
[null,"PARKEERONDERZOEK",null,"CARPOOLPARKINGS EN P+R PARKINGS"]
[null,6,null,{"$f":"B8 & \" - \"& TEXT(VLOOKUP(B3,Coordinaten!$A$2:$G$95,7,0),\"dddd dd mmmm jjjj\")","v":"Carpool parking Overijse, Overijse - donderdag 18 november 2021"}]
[null,{"$f":"VLOOKUP(B3,Coordinaten!$A$2:$G$95,6,0)","v":"50.755140, 4.526412"}]
[null,null,null,"BEZETTING  ",null,null,null,null,null,null,null,null,null,null,null,null,"OPMERKINGEN"]
[]
[null,"Onderzoeksgebied",null,"Datum","Geregistreerd tussen","Pers","Vracht","Motor","Obstakel / overig","Fout   pers","Fout Vracht","Totaal","E-wagen\nplaats","Invalidenplaats","Gestalde fietsen",null,null,null,null,null,{"$f":"F7","v":"Pers"},"Vracht","Motor","Obstakel / overig","Fout   pers","Fout Vracht"]
[null,{"$f":"VLOOKUP(B3,Coordinaten!$A$2:$G$95,3,0)&\", \"&VLOOKUP(B3,Coordinaten!$A$2:$G$95,5,0)","v":"Carpool parking Overijse, Overijse"},null,"2021-11-18","09:00 - 16:00u",20,0,0,0,1,0,21,0,0,0,null,0,null,{"$f":"D8","v":"2021-11-18"},{"$f":"E8","v":"09:00 - 16:00u"},{"$f":"IF(F8=0,NA(),F8/$L8)","v":0.95238095238095233},{"$f":"IF(G8=0,NA(),G8/$L8)","v":{"$error":"#N/A"}},{"$f":"IF(H8=0,NA(),H8/$L8)","v":{"$error":"#N/A"}},{"$error":"#N/A"},4.7619047619047616E-2,{"$error":"#N/A"}]
[null,{"$f":"\"Nabij kruispunt: \"&VLOOKUP(B3,Coordinaten!$A$2:$L$95,4,0)","v":"Nabij kruispunt: Kerkeweg / N253"},null,null,null,0.95238095238095233,"-","-","-",4.7619047619047616E-2,"-",1,null,null,null,null,0,null,{"$f":"D10","v":"2021-11-18"},{"$f":"E10","v":"19:00 - 02:00u"},{"$f":"IF(F10=0,NA(),F10/$L10)","v":0.88888888888888884},{"$f":"IF(G10=0,NA(),G10/$L10)","v":{"$error":"#N/A"}},{"$error":"#N/A"},{"$error":"#N/A"},0.1111111111111111,{"$error":"#N/A"}]
[null,null,null,"2021-11-18","19:00 - 02:00u",8,0,0,0,1,0,9,0,0,0,null,0]
[null,"Meting",null,null,null,0.88888888888888884,"-","-","-",0.1111111111111111,"-",1,null,null,null,null,0]
[null,{"$f":"\"Meetperiode: \"&TEXT(VLOOKUP(B3,Coordinaten!$A$2:$G$95,7,0),\"dddd d mmmm jjjj\")","v":"Meetperiode: donderdag 18 november 2021"}]
[null,"Methodiek: Parkeerdrukmeting met waarnemers"]
[null,"In opdracht van: Vlaamse overheid"]
[null,"Uitgevoerd door: Dufec"]
[null,null,null,"VERDELING NAAR CATEGORIE"]
[null,"Locatie"]
[null,{"$f":"IF(B4=\"\",\"\",HYPERLINK(\"http://www.googlemaps.com/?q=\"&B4,\"Lat/Long: \"&B4))","v":"Lat/Long: 50.755140, 4.526412"}]
[]
[null,null,null,null,null,null,null,null,null,null,null,null,null,null,null,"Legenda"]
[null,null,null,null,null,null,null,null,null,null,null,null,null,null,null,null,"Personenwagen"]
[null,null,null,null,null,null,null,null,null,null,null,null,null,null,null,null,"Vracht"]
[null,null,null,null,null,null,null,null,null,null,null,null,null,null,null,null,"Motor"]
[null,null,null,null,null,null,null,null,null,null,null,null,null,null,null,null,"Obstakel / overig"]
[null,null,null,null,null,null,null,null,null,null,null,null,null,null,null,null,"Fout personenwagen"]
[null,null,null,null,null,null,null,null,null,null,null,null,null,null,null,null,"Fout Vracht"]
[]
[]
[]
[]
[]
[]
[]
[]
[]
[]
[]
[null,"Opmerking"]
[null,"Het onderzoek vindt plaats gedurende coronamaatregelen."]
[null,"Dit heeft mogelijk een effect op de resultaten."]
[]
[null,"Toelichting"]
[null,"Pers = personenwagens op daarvoor bestemde"]
[null,"          openbare plaatsen"]
[null,"Vracht = vrachtwagens op daarvoor bestemde"]
[null,"          parkeerplaatsen (middel- en zwaar vrachtverkeer)"]
[null,"Motor = geparkeerde motoren op openbare plaatsen"]
[null,"Obstakel / overig = obstakels of overige voertuigen"]
[null,"          geparkeerd op openbare plaatsen"]
[null,"Fout pers = personenwagens die fout geparkeerd staan"]
[null,"Fout vracht = vrachtwagens die fout geparkeerd staan"]
[null,"E-wagen = geparkeerde elektrisch voertuig bij een"]
[null,"          elektrisch oplaadpunt"]
[null,"Invalide = personenwagens en motoren op voor"]
[null,"          invalide personen bestemde parkeerplaats"]
[null,"Gestalde fietsen = alle gestalde fietsen op de"]
[null,"          daarvoor bestemde parkeerplaatsen"]

{"sheet":"7.St. Michiels","index":6,"n_rows":57,"n_cols":26,"rows_kept":57,"cut":false,"hidden":false,"merged":[[4,3,5,12],[4,16,5,16],[15,3,16,12]]}
[]
[null,"PARKEERONDERZOEK",null,"CARPOOLPARKINGS EN P+R PARKINGS"]
[null,7,null,{"$f":"B8 & \" - \"& TEXT(VLOOKUP(B3,Coordinaten!$A$2:$G$95,7,0),\"dddd dd mmmm jjjj\")","v":"Carpool parking St. Michiels, Brugge - dinsdag 09 november 2021"}]
[null,{"$f":"VLOOKUP(B3,Coordinaten!$A$2:$G$95,6,0)","v":"51.194190, 3.197624"}]
[null,null,null,"BEZETTING  ",null,null,null,null,null,null,null,null,null,null,null,null,"OPMERKINGEN"]
[]
[null,"Onderzoeksgebied",null,"Datum","Geregistreerd tussen","Pers","Vracht","Motor","Obstakel / overig","Fout   pers","Fout Vracht","Totaal","E-wagen\nplaats","Invalidenplaats","Gestalde fietsen",null,null,null,null,null,{"$f":"F7","v":"Pers"},"Vracht","Motor","Obstakel / overig","Fout   pers","Fout Vracht"]
[null,{"$f":"VLOOKUP(B3,Coordinaten!$A$2:$G$95,3,0)&\", \"&VLOOKUP(B3,Coordinaten!$A$2:$G$95,5,0)","v":"Carpool parking St. Michiels, Brugge"},null,"2021-11-09","09:00 - 16:00u",44,0,0,0,0,0,44,1,0,1,null,0,null,{"$f":"D8","v":"2021-11-09"},{"$f":"E8","v":"09:00 - 16:00u"},{"$f":"IF(F8=0,NA(),F8/$L8)","v":1},{"$f":"IF(G8=0,NA(),G8/$L8)","v":{"$error":"#N/A"}},{"$f":"IF(H8=0,NA(),H8/$L8)","v":{"$error":"#N/A"}},{"$error":"#N/A"},{"$error":"#N/A"},{"$error":"#N/A"}]
[null,{"$f":"\"Nabij kruispunt: \"&VLOOKUP(B3,Coordinaten!$A$2:$L$95,4,0)","v":"Nabij kruispunt: N31 / N32"},null,null,null,1,"-","-","-","-","-",1,null,null,null,null,0,null,{"$f":"D10","v":"2021-11-09"},{"$f":"E10","v":"19:00 - 02:00u"},{"$f":"IF(F10=0,NA(),F10/$L10)","v":1},{"$f":"IF(G10=0,NA(),G10/$L10)","v":{"$error":"#N/A"}},{"$error":"#N/A"},{"$error":"#N/A"},{"$error":"#N/A"},{"$error":"#N/A"}]
[null,null,null,"2021-11-09","19:00 - 02:00u",5,0,0,0,0,0,5,0,0,0,null,0]
[null,"Meting",null,null,null,1,"-","-","-","-","-",1,null,null,null,null,0]
[null,{"$f":"\"Meetperiode: \"&TEXT(VLOOKUP(B3,Coordinaten!$A$2:$G$95,7,0),\"dddd d mmmm jjjj\")","v":"Meetperiode: dinsdag 9 november 2021"}]
[null,"Methodiek: Parkeerdrukmeting met waarnemers"]
[null,"In opdracht van: Vlaamse overheid"]
[null,"Uitgevoerd door: Dufec"]
[null,null,null,"VERDELING NAAR CATEGORIE"]
[null,"Locatie"]
[null,{"$f":"IF(B4=\"\",\"\",HYPERLINK(\"http://www.googlemaps.com/?q=\"&B4,\"Lat/Long: \"&B4))","v":"Lat/Long: 51.194190, 3.197624"}]
[]
[null,null,null,null,null,null,null,null,null,null,null,null,null,null,null,"Legenda"]
[null,null,null,null,null,null,null,null,null,null,null,null,null,null,null,null,"Personenwagen"]
[null,null,null,null,null,null,null,null,null,null,null,null,null,null,null,null,"Vracht"]
[null,null,null,null,null,null,null,null,null,null,null,null,null,null,null,null,"Motor"]
[null,null,null,null,null,null,null,null,null,null,null,null,null,null,null,null,"Obstakel / overig"]
[null,null,null,null,null,null,null,null,null,null,null,null,null,null,null,null,"Fout personenwagen"]
[null,null,null,null,null,null,null,null,null,null,null,null,null,null,null,null,"Fout Vracht"]
[]
[]
[]
[]
[]
[]
[]
[]
[]
[]
[]
[null,"Opmerking"]
[null,"Het onderzoek vindt plaats gedurende coronamaatregelen."]
[null,"Dit heeft mogelijk een effect op de resultaten."]
[]
[null,"Toelichting"]
[null,"Pers = personenwagens op daarvoor bestemde"]
[null,"          openbare plaatsen"]
[null,"Vracht = vrachtwagens op daarvoor bestemde"]
[null,"          parkeerplaatsen (middel- en zwaar vrachtverkeer)"]
[null,"Motor = geparkeerde motoren op openbare plaatsen"]
[null,"Obstakel / overig = obstakels of overige voertuigen"]
[null,"          geparkeerd op openbare plaatsen"]
[null,"Fout pers = personenwagens die fout geparkeerd staan"]
[null,"Fout vracht = vrachtwagens die fout geparkeerd staan"]
[null,"E-wagen = geparkeerde elektrisch voertuig bij een"]
[null,"          elektrisch oplaadpunt"]
[null,"Invalide = personenwagens en motoren op voor"]
[null,"          invalide personen bestemde parkeerplaats"]
[null,"Gestalde fietsen = alle gestalde fietsen op de"]
[null,"          daarvoor bestemde parkeerplaatsen"]

{"sheet":"8.Izegem","index":7,"n_rows":57,"n_cols":26,"rows_kept":57,"cut":false,"hidden":false,"merged":[[4,3,5,12],[4,16,5,16],[15,3,16,12]]}
[]
[null,"PARKEERONDERZOEK",null,"CARPOOLPARKINGS EN P+R PARKINGS"]
[null,8,null,{"$f":"B8 & \" - \"& TEXT(VLOOKUP(B3,Coordinaten!$A$2:$G$95,7,0),\"dddd dd mmmm jjjj\")","v":"Carpool parking Izegem, Roeselare - dinsdag 23 november 2021"}]
[null,{"$f":"VLOOKUP(B3,Coordinaten!$A$2:$G$95,6,0)","v":"50.940676, 3.160323"}]
[null,null,null,"BEZETTING  ",null,null,null,null,null,null,null,null,null,null,null,null,"OPMERKINGEN"]
[]
[null,"Onderzoeksgebied",null,"Datum","Geregistreerd tussen","Pers","Vracht","Motor","Obstakel / overig","Fout   pers","Fout Vracht","Totaal","E-wagen\nplaats","Invalidenplaats","Gestalde fietsen",null,null,null,null,null,{"$f":"F7","v":"Pers"},"Vracht","Motor","Obstakel / overig","Fout   pers","Fout Vracht"]
[null,{"$f":"VLOOKUP(B3,Coordinaten!$A$2:$G$95,3,0)&\", \"&VLOOKUP(B3,Coordinaten!$A$2:$G$95,5,0)","v":"Carpool parking Izegem, Roeselare"},null,"2021-11-23","09:00 - 16:00u",5,0,0,0,0,0,5,0,0,0,null,"Vanaf 20 november nieuwe coronamaatregelen, waaronder verplicht telewerk",null,{"$f":"D8","v":"2021-11-23"},{"$f":"E8","v":"09:00 - 16:00u"},{"$f":"IF(F8=0,NA(),F8/$L8)","v":1},{"$f":"IF(G8=0,NA(),G8/$L8)","v":{"$error":"#N/A"}},{"$f":"IF(H8=0,NA(),H8/$L8)","v":{"$error":"#N/A"}},{"$error":"#N/A"},{"$error":"#N/A"},{"$error":"#N/A"}]
[null,{"$f":"\"Nabij kruispunt: \"&VLOOKUP(B3,Coordinaten!$A$2:$L$95,4,0)","v":"Nabij kruispunt: N382c / Schaapbruggestraat"},null,null,null,1,"-","-","-","-","-",1,null,null,null,null,0,null,{"$f":"D10","v":"2021-11-23"},{"$f":"E10","v":"19:00 - 02:00u"},{"$f":"IF(F10=0,NA(),F10/$L10)","v":{"$error":"#N/A"}},{"$f":"IF(G10=0,NA(),G10/$L10)","v":{"$error":"#N/A"}},{"$error":"#N/A"},{"$error":"#N/A"},{"$error":"#N/A"},{"$error":"#N/A"}]
[null,null,null,"2021-11-23","19:00 - 02:00u",0,0,0,0,0,0,0,0,0,0,null,"Vanaf 20 november nieuwe coronamaatregelen, waaronder verplicht telewerk"]
[null,"Meting",null,null,null,"-","-","-","-","-","-","-",null,null,null,null,"Slagboom staat omlaag"]
[null,{"$f":"\"Meetperiode: \"&TEXT(VLOOKUP(B3,Coordinaten!$A$2:$G$95,7,0),\"dddd dd mmmm jjjj\")","v":"Meetperiode: dinsdag 23 november 2021"}]
[null,"Methodiek: Parkeerdrukmeting met waarnemers"]
[null,"In opdracht van: Vlaamse overheid"]
[null,"Uitgevoerd door: Dufec"]
[null,null,null,"VERDELING NAAR CATEGORIE"]
[null,"Locatie"]
[null,{"$f":"IF(B4=\"\",\"\",HYPERLINK(\"http://www.googlemaps.com/?q=\"&B4,\"Lat/Long: \"&B4))","v":"Lat/Long: 50.940676, 3.160323"}]
[]
[null,null,null,null,null,null,null,null,null,null,null,null,null,null,null,"Legenda"]
[null,null,null,null,null,null,null,null,null,null,null,null,null,null,null,null,"Personenwagen"]
[null,null,null,null,null,null,null,null,null,null,null,null,null,null,null,null,"Vracht"]
[null,null,null,null,null,null,null,null,null,null,null,null,null,null,null,null,"Motor"]
[null,null,null,null,null,null,null,null,null,null,null,null,null,null,null,null,"Obstakel / overig"]
[null,null,null,null,null,null,null,null,null,null,null,null,null,null,null,null,"Fout personenwagen"]
[null,null,null,null,null,null,null,null,null,null,null,null,null,null,null,null,"Fout Vracht"]
[]
[]
[]
[]
[]
[]
[]
[]
[]
[]
[]
[null,"Opmerking"]
[null,"Het onderzoek vindt plaats gedurende coronamaatregelen."]
[null,"Dit heeft mogelijk een effect op de resultaten."]
[]
[null,"Toelichting"]
[null,"Pers = personenwagens op daarvoor bestemde"]
[null,"          openbare plaatsen"]
[null,"Vracht = vrachtwagens op daarvoor bestemde"]
[null,"          parkeerplaatsen (middel- en zwaar vrachtverkeer)"]
[null,"Motor = geparkeerde motoren op openbare plaatsen"]
[null,"Obstakel / overig = obstakels of overige voertuigen"]
[null,"          geparkeerd op openbare plaatsen"]
[null,"Fout pers = personenwagens die fout geparkeerd staan"]
[null,"Fout vracht = vrachtwagens die fout geparkeerd staan"]
[null,"E-wagen = geparkeerde elektrisch voertuig bij een"]
[null,"          elektrisch oplaadpunt"]
[null,"Invalide = personenwagens en motoren op voor"]
[null,"          invalide personen bestemde parkeerplaats"]
[null,"Gestalde fietsen = alle gestalde fietsen op de"]
[null,"          daarvoor bestemde parkeerplaatsen"]

{"sheet":"9.Torhout","index":8,"n_rows":57,"n_cols":26,"rows_kept":57,"cut":false,"hidden":false,"merged":[[4,3,5,12],[4,16,5,16],[15,3,16,12]]}
[]
[null,"PARKEERONDERZOEK",null,"CARPOOLPARKINGS EN P+R PARKINGS"]
[null,9,null,{"$f":"B8 & \" - \"& TEXT(VLOOKUP(B3,Coordinaten!$A$2:$G$95,7,0),\"dddd dd mmmm jjjj\")","v":"Carpool parking Torhout, Torhout - dinsdag 23 november 2021"}]
[null,{"$f":"VLOOKUP(B3,Coordinaten!$A$2:$G$95,6,0)","v":"51.077896, 3.118743"}]
[null,null,null,"BEZETTING  ",null,null,null,null,null,null,null,null,null,null,null,null,"OPMERKINGEN"]
[]
[null,"Onderzoeksgebied",null,"Datum","Geregistreerd tussen","Pers","Vracht","Motor","Obstakel / overig","Fout   pers","Fout Vracht","Totaal","E-wagen\nplaats","Invalidenplaats","Gestalde fietsen",null,null,null,null,null,{"$f":"F7","v":"Pers"},"Vracht","Motor","Obstakel / overig","Fout   pers","Fout Vracht"]
[null,{"$f":"VLOOKUP(B3,Coordinaten!$A$2:$G$95,3,0)&\", \"&VLOOKUP(B3,Coordinaten!$A$2:$G$95,5,0)","v":"Carpool parking Torhout, Torhout"},null,"2021-11-23","09:00 - 16:00u",10,0,0,1,0,0,11,0,0,2,null,"Vanaf 20 november nieuwe coronamaatregelen, waaronder verplicht telewerk",null,{"$f":"D8","v":"2021-11-23"},{"$f":"E8","v":"09:00 - 16:00u"},{"$f":"IF(F8=0,NA(),F8/$L8)","v":0.90909090909090906},{"$f":"IF(G8=0,NA(),G8/$L8)","v":{"$error":"#N/A"}},{"$f":"IF(H8=0,NA(),H8/$L8)","v":{"$error":"#N/A"}},9.0909090909090912E-2,{"$error":"#N/A"},{"$error":"#N/A"}]
[null,{"$f":"\"Nabij kruispunt: \"&VLOOKUP(B3,Coordinaten!$A$2:$L$95,4,0)","v":"Nabij kruispunt: R34 / Keibergstraat"},null,null,null,0.90909090909090906,"-","-",9.0909090909090912E-2,"-","-",1,null,null,null,null,"Overig: Tractor op gras",null,{"$f":"D10","v":"2021-11-23"},{"$f":"E10","v":"19:00 - 02:00u"},{"$f":"IF(F10=0,NA(),F10/$L10)","v":0.75},{"$f":"IF(G10=0,NA(),G10/$L10)","v":{"$error":"#N/A"}},{"$error":"#N/A"},0.125,0.125,{"$error":"#N/A"}]
[null,null,null,"2021-11-23","19:00 - 02:00u",6,0,0,1,1,0,8,0,0,0,null,"Vanaf 20 november nieuwe coronamaatregelen, waaronder verplicht telewerk"]
[null,"Meting",null,null,null,0.75,"-","-",0.125,0.125,"-",1,null,null,null,null,"Overig: Tractor op gras"]
[null,{"$f":"\"Meetperiode: \"&TEXT(VLOOKUP(B3,Coordinaten!$A$2:$G$95,7,0),\"dddd dd mmmm jjjj\")","v":"Meetperiode: dinsdag 23 november 2021"}]
[null,"Methodiek: Parkeerdrukmeting met waarnemers"]
[null,"In opdracht van: Vlaamse overheid"]
[null,"Uitgevoerd door: Dufec"]
[null,null,null,"VERDELING NAAR CATEGORIE"]
[null,"Locatie"]
[null,{"$f":"IF(B4=\"\",\"\",HYPERLINK(\"http://www.googlemaps.com/?q=\"&B4,\"Lat/Long: \"&B4))","v":"Lat/Long: 51.077896, 3.118743"}]
[]
[null,null,null,null,null,null,null,null,null,null,null,null,null,null,null,"Legenda"]
[null,null,null,null,null,null,null,null,null,null,null,null,null,null,null,null,"Personenwagen"]
[null,null,null,null,null,null,null,null,null,null,null,null,null,null,null,null,"Vracht"]
[null,null,null,null,null,null,null,null,null,null,null,null,null,null,null,null,"Motor"]
[null,null,null,null,null,null,null,null,null,null,null,null,null,null,null,null,"Obstakel / overig"]
[null,null,null,null,null,null,null,null,null,null,null,null,null,null,null,null,"Fout personenwagen"]
[null,null,null,null,null,null,null,null,null,null,null,null,null,null,null,null,"Fout Vracht"]
[]
[]
[]
[]
[]
[]
[]
[]
[]
[]
[]
[null,"Opmerking"]
[null,"Het onderzoek vindt plaats gedurende coronamaatregelen."]
[null,"Dit heeft mogelijk een effect op de resultaten."]
[]
[null,"Toelichting"]
[null,"Pers = personenwagens op daarvoor bestemde"]
[null,"          openbare plaatsen"]
[null,"Vracht = vrachtwagens op daarvoor bestemde"]
[null,"          parkeerplaatsen (middel- en zwaar vrachtverkeer)"]
[null,"Motor = geparkeerde motoren op openbare plaatsen"]
[null,"Obstakel / overig = obstakels of overige voertuigen"]
[null,"          geparkeerd op openbare plaatsen"]
[null,"Fout pers = personenwagens die fout geparkeerd staan"]
[null,"Fout vracht = vrachtwagens die fout geparkeerd staan"]
[null,"E-wagen = geparkeerde elektrisch voertuig bij een"]
[null,"          elektrisch oplaadpunt"]
[null,"Invalide = personenwagens en motoren op voor"]
[null,"          invalide personen bestemde parkeerplaats"]
[null,"Gestalde fietsen = alle gestalde fietsen op de"]
[null,"          daarvoor bestemde parkeerplaatsen"]

{"sheet":"10.Houthalen","index":9,"n_rows":57,"n_cols":26,"rows_kept":57,"cut":false,"hidden":false,"merged":[[4,3,5,12],[4,16,5,16],[15,3,16,12]]}
[]
[null,"PARKEERONDERZOEK",null,"CARPOOLPARKINGS EN P+R PARKINGS"]
[null,10,null,{"$f":"B8 & \" - \"& TEXT(VLOOKUP(B3,Coordinaten!$A$2:$G$95,7,0),\"dddd dd mmmm jjjj\")","v":"Carpool parking Houthalen, Houthalen-Helchteren - dinsdag 16 november 2021"}]
[null,{"$f":"VLOOKUP(B3,Coordinaten!$A$2:$G$95,6,0)","v":"51.015552, 5.371400"}]
[null,null,null,"BEZETTING  ",null,null,null,null,null,null,null,null,null,null,null,null,"OPMERKINGEN"]
[]
[null,"Onderzoeksgebied",null,"Datum","Geregistreerd tussen","Pers","Vracht","Motor","Obstakel / overig","Fout   pers","Fout Vracht","Totaal","E-wagen\nplaats","Invalidenplaats","Gestalde fietsen",null,null,null,null,null,{"$f":"F7","v":"Pers"},"Vracht","Motor","Obstakel / overig","Fout   pers","Fout Vracht"]
[null,{"$f":"VLOOKUP(B3,Coordinaten!$A$2:$G$95,3,0)&\", \"&VLOOKUP(B3,Coordinaten!$A$2:$G$95,5,0)","v":"Carpool parking Houthalen, Houthalen-Helchteren"},null,"2021-11-16","09:00 - 16:00u",80,0,0,0,0,0,80,0,0,2,null,0,null,{"$f":"D8","v":"2021-11-16"},{"$f":"E8","v":"09:00 - 16:00u"},{"$f":"IF(F8=0,NA(),F8/$L8)","v":1},{"$f":"IF(G8=0,NA(),G8/$L8)","v":{"$error":"#N/A"}},{"$f":"IF(H8=0,NA(),H8/$L8)","v":{"$error":"#N/A"}},{"$error":"#N/A"},{"$error":"#N/A"},{"$error":"#N/A"}]
[null,{"$f":"\"Nabij kruispunt: \"&VLOOKUP(B3,Coordinaten!$A$2:$L$95,4,0)","v":"Nabij kruispunt: N715 / A2"},null,null,null,1,"-","-","-","-","-",1,null,null,null,null,0,null,{"$f":"D10","v":"2021-11-16"},{"$f":"E10","v":"19:00 - 02:00u"},{"$f":"IF(F10=0,NA(),F10/$L10)","v":1},{"$f":"IF(G10=0,NA(),G10/$L10)","v":{"$error":"#N/A"}},{"$error":"#N/A"},{"$error":"#N/A"},{"$error":"#N/A"},{"$error":"#N/A"}]
[null,null,null,"2021-11-16","19:00 - 02:00u",30,0,0,0,0,0,30,0,0,0,null,0]
[null,"Meting",null,null,null,1,"-","-","-","-","-",1,null,null,null,null,0]
[null,{"$f":"\"Meetperiode: \"&TEXT(VLOOKUP(B3,Coordinaten!$A$2:$G$95,7,0),\"dddd dd mmmm jjjj\")","v":"Meetperiode: dinsdag 16 november 2021"}]
[null,"Methodiek: Parkeerdrukmeting met waarnemers"]
[null,"In opdracht van: Vlaamse overheid"]
[null,"Uitgevoerd door: Dufec"]
[null,null,null,"VERDELING NAAR CATEGORIE"]
[null,"Locatie"]
[null,{"$f":"IF(B4=\"\",\"\",HYPERLINK(\"http://www.googlemaps.com/?q=\"&B4,\"Lat/Long: \"&B4))","v":"Lat/Long: 51.015552, 5.371400"}]
[]
[null,null,null,null,null,null,null,null,null,null,null,null,null,null,null,"Legenda"]
[null,null,null,null,null,null,null,null,null,null,null,null,null,null,null,null,"Personenwagen"]
[null,null,null,null,null,null,null,null,null,null,null,null,null,null,null,null,"Vracht"]
[null,null,null,null,null,null,null,null,null,null,null,null,null,null,null,null,"Motor"]
[null,null,null,null,null,null,null,null,null,null,null,null,null,null,null,null,"Obstakel / overig"]
[null,null,null,null,null,null,null,null,null,null,null,null,null,null,null,null,"Fout personenwagen"]
[null,null,null,null,null,null,null,null,null,null,null,null,null,null,null,null,"Fout Vracht"]
[]
[]
[]
[]
[]
[]
[]
[]
[]
[]
[]
[null,"Opmerking"]
[null,"Het onderzoek vindt plaats gedurende coronamaatregelen."]
[null,"Dit heeft mogelijk een effect op de resultaten."]
[]
[null,"Toelichting"]
[null,"Pers = personenwagens op daarvoor bestemde"]
[null,"          openbare plaatsen"]
[null,"Vracht = vrachtwagens op daarvoor bestemde"]
[null,"          parkeerplaatsen (middel- en zwaar vrachtverkeer)"]
[null,"Motor = geparkeerde motoren op openbare plaatsen"]
[null,"Obstakel / overig = obstakels of overige voertuigen"]
[null,"          geparkeerd op openbare plaatsen"]
[null,"Fout pers = personenwagens die fout geparkeerd staan"]
[null,"Fout vracht = vrachtwagens die fout geparkeerd staan"]
[null,"E-wagen = geparkeerde elektrisch voertuig bij een"]
[null,"          elektrisch oplaadpunt"]
[null,"Invalide = personenwagens en motoren op voor"]
[null,"          invalide personen bestemde parkeerplaats"]
[null,"Gestalde fietsen = alle gestalde fietsen op de"]
[null,"          daarvoor bestemde parkeerplaatsen"]

{"sheet":"11.Diepenbeek","index":10,"n_rows":57,"n_cols":26,"rows_kept":57,"cut":false,"hidden":false,"merged":[[4,3,5,12],[4,16,5,16],[15,3,16,12]]}
[]
[null,"PARKEERONDERZOEK",null,"CARPOOLPARKINGS EN P+R PARKINGS"]
[null,11,null,{"$f":"B8 & \" - \"& TEXT(VLOOKUP(B3,Coordinaten!$A$2:$G$95,7,0),\"dddd dd mmmm jjjj\")","v":"Carpool parking Diepenbeek, Diepenbeek - dinsdag 16 november 2021"}]
[null,{"$f":"VLOOKUP(B3,Coordinaten!$A$2:$G$95,6,0)","v":"50.894087, 5.417912"}]
[null,null,null,"BEZETTING  ",null,null,null,null,null,null,null,null,null,null,null,null,"OPMERKINGEN"]
[]
[null,"Onderzoeksgebied",null,"Datum","Geregistreerd tussen","Pers","Vracht","Motor","Obstakel / overig","Fout   pers","Fout Vracht","Totaal","E-wagen\nplaats","Invalidenplaats","Gestalde fietsen",null,null,null,null,null,{"$f":"F7","v":"Pers"},"Vracht","Motor","Obstakel / overig","Fout   pers","Fout Vracht"]
[null,{"$f":"VLOOKUP(B3,Coordinaten!$A$2:$G$95,3,0)&\", \"&VLOOKUP(B3,Coordinaten!$A$2:$G$95,5,0)","v":"Carpool parking Diepenbeek, Diepenbeek"},null,"2021-11-16","09:00 - 16:00u",56,0,0,0,0,0,56,0,0,1,null,0,null,{"$f":"D8","v":"2021-11-16"},{"$f":"E8","v":"09:00 - 16:00u"},{"$f":"IF(F8=0,NA(),F8/$L8)","v":1},{"$f":"IF(G8=0,NA(),G8/$L8)","v":{"$error":"#N/A"}},{"$f":"IF(H8=0,NA(),H8/$L8)","v":{"$error":"#N/A"}},{"$error":"#N/A"},{"$error":"#N/A"},{"$error":"#N/A"}]
[null,{"$f":"\"Nabij kruispunt: \"&VLOOKUP(B3,Coordinaten!$A$2:$L$95,4,0)","v":"Nabij kruispunt: N76 / A13"},null,null,null,1,"-","-","-","-","-",1,null,null,null,null,0,null,{"$f":"D10","v":"2021-11-16"},{"$f":"E10","v":"19:00 - 02:00u"},{"$f":"IF(F10=0,NA(),F10/$L10)","v":1},{"$f":"IF(G10=0,NA(),G10/$L10)","v":{"$error":"#N/A"}},{"$error":"#N/A"},{"$error":"#N/A"},{"$error":"#N/A"},{"$error":"#N/A"}]
[null,null,null,"2021-11-16","19:00 - 02:00u",14,0,0,0,0,0,14,0,0,1,null,0]
[null,"Meting",null,null,null,1,"-","-","-","-","-",1,null,null,null,null,0]
[null,{"$f":"\"Meetperiode: \"&TEXT(VLOOKUP(B3,Coordinaten!$A$2:$G$95,7,0),\"dddd dd mmmm jjjj\")","v":"Meetperiode: dinsdag 16 november 2021"}]
[null,"Methodiek: Parkeerdrukmeting met waarnemers"]
[null,"In opdracht van: Vlaamse overheid"]
[null,"Uitgevoerd door: Dufec"]
[null,null,null,"VERDELING NAAR CATEGORIE"]
[null,"Locatie"]
[null,{"$f":"IF(B4=\"\",\"\",HYPERLINK(\"http://www.googlemaps.com/?q=\"&B4,\"Lat/Long: \"&B4))","v":"Lat/Long: 50.894087, 5.417912"}]
[]
[null,null,null,null,null,null,null,null,null,null,null,null,null,null,null,"Legenda"]
[null,null,null,null,null,null,null,null,null,null,null,null,null,null,null,null,"Personenwagen"]
[null,null,null,null,null,null,null,null,null,null,null,null,null,null,null,null,"Vracht"]
[null,null,null,null,null,null,null,null,null,null,null,null,null,null,null,null,"Motor"]
[null,null,null,null,null,null,null,null,null,null,null,null,null,null,null,null,"Obstakel / overig"]
[null,null,null,null,null,null,null,null,null,null,null,null,null,null,null,null,"Fout personenwagen"]
[null,null,null,null,null,null,null,null,null,null,null,null,null,null,null,null,"Fout Vracht"]
[]
[]
[]
[]
[]
[]
[]
[]
[]
[]
[]
[null,"Opmerking"]
[null,"Het onderzoek vindt plaats gedurende coronamaatregelen."]
[null,"Dit heeft mogelijk een effect op de resultaten."]
[]
[null,"Toelichting"]
[null,"Pers = personenwagens op daarvoor bestemde"]
[null,"          openbare plaatsen"]
[null,"Vracht = vrachtwagens op daarvoor bestemde"]
[null,"          parkeerplaatsen (middel- en zwaar vrachtverkeer)"]
[null,"Motor = geparkeerde motoren op openbare plaatsen"]
[null,"Obstakel / overig = obstakels of overige voertuigen"]
[null,"          geparkeerd op openbare plaatsen"]
[null,"Fout pers = personenwagens die fout geparkeerd staan"]
[null,"Fout vracht = vrachtwagens die fout geparkeerd staan"]
[null,"E-wagen = geparkeerde elektrisch voertuig bij een"]
[null,"          elektrisch oplaadpunt"]
[null,"Invalide = personenwagens en motoren op voor"]
[null,"          invalide personen bestemde parkeerplaats"]
[null,"Gestalde fietsen = alle gestalde fietsen op de"]
[null,"          daarvoor bestemde parkeerplaatsen"]

{"sheet":"12.Wommelgem-Zuid","index":11,"n_rows":57,"n_cols":26,"rows_kept":57,"cut":false,"hidden":false,"merged":[[4,3,5,12],[4,16,5,16],[15,3,16,12]]}
[]
[null,"PARKEERONDERZOEK",null,"CARPOOLPARKINGS EN P+R PARKINGS"]
[null,12,null,{"$f":"B8 & \" - \"& TEXT(VLOOKUP(B3,Coordinaten!$A$2:$G$95,7,0),\"dddd dd mmmm jjjj\")","v":"P+R parking Wommelgem-Zuid, Wommelgem - donderdag 18 november 2021"}]
[null,{"$f":"VLOOKUP(B3,Coordinaten!$A$2:$G$95,6,0)","v":"51.210463, 4.493799"}]
[null,null,null,"BEZETTING  ",null,null,null,null,null,null,null,null,null,null,null,null,"OPMERKINGEN"]
[]
[null,"Onderzoeksgebied",null,"Datum","Geregistreerd tussen","Pers","Vracht","Motor","Obstakel / overig","Fout   pers","Fout Vracht","Totaal","E-wagen\nplaats","Invalidenplaats","Gestalde fietsen",null,null,null,null,null,{"$f":"F7","v":"Pers"},"Vracht","Motor","Obstakel / overig","Fout   pers","Fout Vracht"]
[null,{"$f":"VLOOKUP(B3,Coordinaten!$A$2:$G$95,3,0)&\", \"&VLOOKUP(B3,Coordinaten!$A$2:$G$95,5,0)","v":"P+R parking Wommelgem-Zuid, Wommelgem"},null,"2021-11-18","09:00 - 16:00u",35,0,0,0,7,0,42,0,0,1,null,0,null,{"$f":"D8","v":"2021-11-18"},{"$f":"E8","v":"09:00 - 16:00u"},{"$f":"IF(F8=0,NA(),F8/$L8)","v":0.83333333333333337},{"$f":"IF(G8=0,NA(),G8/$L8)","v":{"$error":"#N/A"}},{"$f":"IF(H8=0,NA(),H8/$L8)","v":{"$error":"#N/A"}},{"$error":"#N/A"},0.16666666666666666,{"$error":"#N/A"}]
[null,{"$f":"\"Nabij kruispunt: \"&VLOOKUP(B3,Coordinaten!$A$2:$L$95,4,0)","v":"Nabij kruispunt: R11 / A13"},null,null,null,0.83333333333333337,"-","-","-",0.16666666666666666,"-",1,null,null,null,null,0,null,{"$f":"D10","v":"2021-11-18"},{"$f":"E10","v":"19:00 - 02:00u"},{"$f":"IF(F10=0,NA(),F10/$L10)","v":1},{"$f":"IF(G10=0,NA(),G10/$L10)","v":{"$error":"#N/A"}},{"$error":"#N/A"},{"$error":"#N/A"},{"$error":"#N/A"},{"$error":"#N/A"}]
[null,null,null,"2021-11-18","19:00 - 02:00u",23,0,0,0,0,0,23,0,0,1,null,0]
[null,"Meting",null,null,null,1,"-","-","-","-","-",1,null,null,null,null,0]
[null,{"$f":"\"Meetperiode: \"&TEXT(VLOOKUP(B3,Coordinaten!$A$2:$G$95,7,0),\"dddd dd mmmm jjjj\")","v":"Meetperiode: donderdag 18 november 2021"}]
[null,"Methodiek: Parkeerdrukmeting met waarnemers"]
[null,"In opdracht van: Vlaamse overheid"]
[null,"Uitgevoerd door: Dufec"]
[null,null,null,"VERDELING NAAR CATEGORIE"]
[null,"Locatie"]
[null,{"$f":"IF(B4=\"\",\"\",HYPERLINK(\"http://www.googlemaps.com/?q=\"&B4,\"Lat/Long: \"&B4))","v":"Lat/Long: 51.210463, 4.493799"}]
[]
[null,null,null,null,null,null,null,null,null,null,null,null,null,null,null,"Legenda"]
[null,null,null,null,null,null,null,null,null,null,null,null,null,null,null,null,"Personenwagen"]
[null,null,null,null,null,null,null,null,null,null,null,null,null,null,null,null,"Vracht"]
[null,null,null,null,null,null,null,null,null,null,null,null,null,null,null,null,"Motor"]
[null,null,null,null,null,null,null,null,null,null,null,null,null,null,null,null,"Obstakel / overig"]
[null,null,null,null,null,null,null,null,null,null,null,null,null,null,null,null,"Fout personenwagen"]
[null,null,null,null,null,null,null,null,null,null,null,null,null,null,null,null,"Fout Vracht"]
[]
[]
[]
[]
[]
[]
[]
[]
[]
[]
[]
[null,"Opmerking"]
[null,"Het onderzoek vindt plaats gedurende coronamaatregelen."]
[null,"Dit heeft mogelijk een effect op de resultaten."]
[]
[null,"Toelichting"]
[null,"Pers = personenwagens op daarvoor bestemde"]
[null,"          openbare plaatsen"]
[null,"Vracht = vrachtwagens op daarvoor bestemde"]
[null,"          parkeerplaatsen (middel- en zwaar vrachtverkeer)"]
[null,"Motor = geparkeerde motoren op openbare plaatsen"]
[null,"Obstakel / overig = obstakels of overige voertuigen"]
[null,"          geparkeerd op openbare plaatsen"]
[null,"Fout pers = personenwagens die fout geparkeerd staan"]
[null,"Fout vracht = vrachtwagens die fout geparkeerd staan"]
[null,"E-wagen = geparkeerde elektrisch voertuig bij een"]
[null,"          elektrisch oplaadpunt"]
[null,"Invalide = personenwagens en motoren op voor"]
[null,"          invalide personen bestemde parkeerplaats"]
[null,"Gestalde fietsen = alle gestalde fietsen op de"]
[null,"          daarvoor bestemde parkeerplaatsen"]

{"sheet":"13.Minitaria","index":12,"n_rows":57,"n_cols":26,"rows_kept":57,"cut":false,"hidden":false,"merged":[[4,3,5,12],[4,16,5,16],[15,3,16,12]]}
[]
[null,"PARKEERONDERZOEK",null,"CARPOOLPARKINGS EN P+R PARKINGS"]
[null,13,null,{"$f":"B8 & \" - \"& TEXT(VLOOKUP(B3,Coordinaten!$A$2:$G$95,7,0),\"dddd dd mmmm jjjj\")","v":"Carpool parking Minitaria, Tienen - dinsdag 16 november 2021"}]
[null,{"$f":"VLOOKUP(B3,Coordinaten!$A$2:$G$95,6,0)","v":"50.799170, 4.970858"}]
[null,null,null,"BEZETTING  ",null,null,null,null,null,null,null,null,null,null,null,null,"OPMERKINGEN"]
[]
[null,"Onderzoeksgebied",null,"Datum","Geregistreerd tussen","Pers","Vracht","Motor","Obstakel / overig","Fout   pers","Fout Vracht","Totaal","E-wagen\nplaats","Invalidenplaats","Gestalde fietsen",null,null,null,null,null,{"$f":"F7","v":"Pers"},"Vracht","Motor","Obstakel / overig","Fout   pers","Fout Vracht"]
[null,{"$f":"VLOOKUP(B3,Coordinaten!$A$2:$G$95,3,0)&\", \"&VLOOKUP(B3,Coordinaten!$A$2:$G$95,5,0)","v":"Carpool parking Minitaria, Tienen"},null,"2021-11-16","09:00 - 16:00u",4,0,0,0,0,0,4,0,0,0,null,0,null,{"$f":"D8","v":"2021-11-16"},{"$f":"E8","v":"09:00 - 16:00u"},{"$f":"IF(F8=0,NA(),F8/$L8)","v":1},{"$f":"IF(G8=0,NA(),G8/$L8)","v":{"$error":"#N/A"}},{"$f":"IF(H8=0,NA(),H8/$L8)","v":{"$error":"#N/A"}},{"$error":"#N/A"},{"$error":"#N/A"},{"$error":"#N/A"}]
[null,{"$f":"\"Nabij kruispunt: \"&VLOOKUP(B3,Coordinaten!$A$2:$L$95,4,0)","v":"Nabij kruispunt: N3 / R27"},null,null,null,1,"-","-","-","-","-",1,null,null,null,null,0,null,{"$f":"D10","v":"2021-11-16"},{"$f":"E10","v":"19:00 - 02:00u"},{"$f":"IF(F10=0,NA(),F10/$L10)","v":1},{"$f":"IF(G10=0,NA(),G10/$L10)","v":{"$error":"#N/A"}},{"$error":"#N/A"},{"$error":"#N/A"},{"$error":"#N/A"},{"$error":"#N/A"}]
[null,null,null,"2021-11-16","19:00 - 02:00u",5,0,0,0,0,0,5,0,0,0,null,0]
[null,"Meting",null,null,null,1,"-","-","-","-","-",1,null,null,null,null,0]
[null,{"$f":"\"Meetperiode: \"&TEXT(VLOOKUP(B3,Coordinaten!$A$2:$G$95,7,0),\"dddd dd mmmm jjjj\")","v":"Meetperiode: dinsdag 16 november 2021"}]
[null,"Methodiek: Parkeerdrukmeting met waarnemers"]
[null,"In opdracht van: Vlaamse overheid"]
[null,"Uitgevoerd door: Dufec"]
[null,null,null,"VERDELING NAAR CATEGORIE"]
[null,"Locatie"]
[null,{"$f":"IF(B4=\"\",\"\",HYPERLINK(\"http://www.googlemaps.com/?q=\"&B4,\"Lat/Long: \"&B4))","v":"Lat/Long: 50.799170, 4.970858"}]
[]
[null,null,null,null,null,null,null,null,null,null,null,null,null,null,null,"Legenda"]
[null,null,null,null,null,null,null,null,null,null,null,null,null,null,null,null,"Personenwagen"]
[null,null,null,null,null,null,null,null,null,null,null,null,null,null,null,null,"Vracht"]
[null,null,null,null,null,null,null,null,null,null,null,null,null,null,null,null,"Motor"]
[null,null,null,null,null,null,null,null,null,null,null,null,null,null,null,null,"Obstakel / overig"]
[null,null,null,null,null,null,null,null,null,null,null,null,null,null,null,null,"Fout personenwagen"]
[null,null,null,null,null,null,null,null,null,null,null,null,null,null,null,null,"Fout Vracht"]
[]
[]
[]
[]
[]
[]
[]
[]
[]
[]
[]
[null,"Opmerking"]
[null,"Het onderzoek vindt plaats gedurende coronamaatregelen."]
[null,"Dit heeft mogelijk een effect op de resultaten."]
[]
[null,"Toelichting"]
[null,"Pers = personenwagens op daarvoor bestemde"]
[null,"          openbare plaatsen"]
[null,"Vracht = vrachtwagens op daarvoor bestemde"]
[null,"          parkeerplaatsen (middel- en zwaar vrachtverkeer)"]
[null,"Motor = geparkeerde motoren op openbare plaatsen"]
[null,"Obstakel / overig = obstakels of overige voertuigen"]
[null,"          geparkeerd op openbare plaatsen"]
[null,"Fout pers = personenwagens die fout geparkeerd staan"]
[null,"Fout vracht = vrachtwagens die fout geparkeerd staan"]
[null,"E-wagen = geparkeerde elektrisch voertuig bij een"]
[null,"          elektrisch oplaadpunt"]
[null,"Invalide = personenwagens en motoren op voor"]
[null,"          invalide personen bestemde parkeerplaats"]
[null,"Gestalde fietsen = alle gestalde fietsen op de"]
[null,"          daarvoor bestemde parkeerplaatsen"]

{"sheet":"14.Hakendover","index":13,"n_rows":57,"n_cols":26,"rows_kept":57,"cut":false,"hidden":false,"merged":[[4,3,5,12],[4,16,5,16],[15,3,16,12]]}
[]
[null,"PARKEERONDERZOEK",null,"CARPOOLPARKINGS EN P+R PARKINGS"]
[null,14,null,{"$f":"B8 & \" - \"& TEXT(VLOOKUP(B3,Coordinaten!$A$2:$G$95,7,0),\"dddd dd mmmm jjjj\")","v":"Carpool parking Hakendover, Tienen - dinsdag 16 november 2021"}]
[null,{"$f":"VLOOKUP(B3,Coordinaten!$A$2:$G$95,6,0)","v":"50.798982, 4.973467"}]
[null,null,null,"BEZETTING  ",null,null,null,null,null,null,null,null,null,null,null,null,"OPMERKINGEN"]
[]
[null,"Onderzoeksgebied",null,"Datum","Geregistreerd tussen","Pers","Vracht","Motor","Obstakel / overig","Fout   pers","Fout Vracht","Totaal","E-wagen\nplaats","Invalidenplaats","Gestalde fietsen",null,null,null,null,null,{"$f":"F7","v":"Pers"},"Vracht","Motor","Obstakel / overig","Fout   pers","Fout Vracht"]
[null,{"$f":"VLOOKUP(B3,Coordinaten!$A$2:$G$95,3,0)&\", \"&VLOOKUP(B3,Coordinaten!$A$2:$G$95,5,0)","v":"Carpool parking Hakendover, Tienen"},null,"2021-11-16","09:00 - 16:00u",4,0,0,1,0,0,5,0,0,0,null,"Obstakel: aanhanger",null,{"$f":"D8","v":"2021-11-16"},{"$f":"E8","v":"09:00 - 16:00u"},{"$f":"IF(F8=0,NA(),F8/$L8)","v":0.8},{"$f":"IF(G8=0,NA(),G8/$L8)","v":{"$error":"#N/A"}},{"$f":"IF(H8=0,NA(),H8/$L8)","v":{"$error":"#N/A"}},0.2,{"$error":"#N/A"},{"$error":"#N/A"}]
[null,{"$f":"\"Nabij kruispunt: \"&VLOOKUP(B3,Coordinaten!$A$2:$L$95,4,0)","v":"Nabij kruispunt: N3 / R27"},null,null,null,0.8,"-","-",0.2,"-","-",1,null,null,null,null,0,null,{"$f":"D10","v":"2021-11-16"},{"$f":"E10","v":"19:00 - 02:00u"},{"$f":"IF(F10=0,NA(),F10/$L10)","v":1},{"$f":"IF(G10=0,NA(),G10/$L10)","v":{"$error":"#N/A"}},{"$error":"#N/A"},{"$error":"#N/A"},{"$error":"#N/A"},{"$error":"#N/A"}]
[null,null,null,"2021-11-16","19:00 - 02:00u",1,0,0,0,0,0,1,0,0,0,null,0]
[null,"Meting",null,null,null,1,"-","-","-","-","-",1,null,null,null,null,0]
[null,{"$f":"\"Meetperiode: \"&TEXT(VLOOKUP(B3,Coordinaten!$A$2:$G$95,7,0),\"dddd dd mmmm jjjj\")","v":"Meetperiode: dinsdag 16 november 2021"}]
[null,"Methodiek: Parkeerdrukmeting met waarnemers"]
[null,"In opdracht van: Vlaamse overheid"]
[null,"Uitgevoerd door: Dufec"]
[null,null,null,"VERDELING NAAR CATEGORIE"]
[null,"Locatie"]
[null,{"$f":"IF(B4=\"\",\"\",HYPERLINK(\"http://www.googlemaps.com/?q=\"&B4,\"Lat/Long: \"&B4))","v":"Lat/Long: 50.798982, 4.973467"}]
[]
[null,null,null,null,null,null,null,null,null,null,null,null,null,null,null,"Legenda"]
[null,null,null,null,null,null,null,null,null,null,null,null,null,null,null,null,"Personenwagen"]
[null,null,null,null,null,null,null,null,null,null,null,null,null,null,null,null,"Vracht"]
[null,null,null,null,null,null,null,null,null,null,null,null,null,null,null,null,"Motor"]
[null,null,null,null,null,null,null,null,null,null,null,null,null,null,null,null,"Obstakel / overig"]
[null,null,null,null,null,null,null,null,null,null,null,null,null,null,null,null,"Fout personenwagen"]
[null,null,null,null,null,null,null,null,null,null,null,null,null,null,null,null,"Fout Vracht"]
[]
[]
[]
[]
[]
[]
[]
[]
[]
[]
[]
[null,"Opmerking"]
[null,"Het onderzoek vindt plaats gedurende coronamaatregelen."]
[null,"Dit heeft mogelijk een effect op de resultaten."]
[]
[null,"Toelichting"]
[null,"Pers = personenwagens op daarvoor bestemde"]
[null,"          openbare plaatsen"]
[null,"Vracht = vrachtwagens op daarvoor bestemde"]
[null,"          parkeerplaatsen (middel- en zwaar vrachtverkeer)"]
[null,"Motor = geparkeerde motoren op openbare plaatsen"]
[null,"Obstakel / overig = obstakels of overige voertuigen"]
[null,"          geparkeerd op openbare plaatsen"]
[null,"Fout pers = personenwagens die fout geparkeerd staan"]
[null,"Fout vracht = vrachtwagens die fout geparkeerd staan"]
[null,"E-wagen = geparkeerde elektrisch voertuig bij een"]
[null,"          elektrisch oplaadpunt"]
[null,"Invalide = personenwagens en motoren op voor"]
[null,"          invalide personen bestemde parkeerplaats"]
[null,"Gestalde fietsen = alle gestalde fietsen op de"]
[null,"          daarvoor bestemde parkeerplaatsen"]

{"sheet":"15.Kontich","index":14,"n_rows":57,"n_cols":26,"rows_kept":57,"cut":false,"hidden":false,"merged":[[4,3,5,12],[4,16,5,16],[15,3,16,12]]}
[]
[null,"PARKEERONDERZOEK",null,"CARPOOLPARKINGS EN P+R PARKINGS"]
[null,15,null,{"$f":"B8 & \" - \"& TEXT(VLOOKUP(B3,Coordinaten!$A$2:$G$95,7,0),\"dddd dd mmmm jjjj\")","v":"Carpool parking Kontich, Kontich - donderdag 18 november 2021"}]
[null,{"$f":"VLOOKUP(B3,Coordinaten!$A$2:$G$95,6,0)","v":"51.126274, 4.432122"}]
[null,null,null,"BEZETTING  ",null,null,null,null,null,null,null,null,null,null,null,null,"OPMERKINGEN"]
[]
[null,"Onderzoeksgebied",null,"Datum","Geregistreerd tussen","Pers","Vracht","Motor","Obstakel / overig","Fout   pers","Fout Vracht","Totaal","E-wagen\nplaats","Invalidenplaats","Gestalde fietsen",null,null,null,null,null,{"$f":"F7","v":"Pers"},"Vracht","Motor","Obstakel / overig","Fout   pers","Fout Vracht"]
[null,{"$f":"VLOOKUP(B3,Coordinaten!$A$2:$G$95,3,0)&\", \"&VLOOKUP(B3,Coordinaten!$A$2:$G$95,5,0)","v":"Carpool parking Kontich, Kontich"},null,"2021-11-18","09:00 - 16:00u",87,0,0,0,0,0,87,0,0,0,null,0,null,{"$f":"D8","v":"2021-11-18"},{"$f":"E8","v":"09:00 - 16:00u"},{"$f":"IF(F8=0,NA(),F8/$L8)","v":1},{"$f":"IF(G8=0,NA(),G8/$L8)","v":{"$error":"#N/A"}},{"$f":"IF(H8=0,NA(),H8/$L8)","v":{"$error":"#N/A"}},{"$error":"#N/A"},{"$error":"#N/A"},{"$error":"#N/A"}]
[null,{"$f":"\"Nabij kruispunt: \"&VLOOKUP(B3,Coordinaten!$A$2:$L$95,4,0)","v":"Nabij kruispunt: N171 / A1"},null,null,null,1,"-","-","-","-","-",1,null,null,null,null,0,null,{"$f":"D10","v":"2021-11-18"},{"$f":"E10","v":"19:00 - 02:00u"},{"$f":"IF(F10=0,NA(),F10/$L10)","v":1},{"$f":"IF(G10=0,NA(),G10/$L10)","v":{"$error":"#N/A"}},{"$error":"#N/A"},{"$error":"#N/A"},{"$error":"#N/A"},{"$error":"#N/A"}]
[null,null,null,"2021-11-18","19:00 - 02:00u",49,0,0,0,0,0,49,0,0,0,null,0]
[null,"Meting",null,null,null,1,"-","-","-","-","-",1,null,null,null,null,0]
[null,{"$f":"\"Meetperiode: \"&TEXT(VLOOKUP(B3,Coordinaten!$A$2:$G$95,7,0),\"dddd dd mmmm jjjj\")","v":"Meetperiode: donderdag 18 november 2021"}]
[null,"Methodiek: Parkeerdrukmeting met waarnemers"]
[null,"In opdracht van: Vlaamse overheid"]
[null,"Uitgevoerd door: Dufec"]
[null,null,null,"VERDELING NAAR CATEGORIE"]
[null,"Locatie"]
[null,{"$f":"IF(B4=\"\",\"\",HYPERLINK(\"http://www.googlemaps.com/?q=\"&B4,\"Lat/Long: \"&B4))","v":"Lat/Long: 51.126274, 4.432122"}]
[]
[null,null,null,null,null,null,null,null,null,null,null,null,null,null,null,"Legenda"]
[null,null,null,null,null,null,null,null,null,null,null,null,null,null,null,null,"Personenwagen"]
[null,null,null,null,null,null,null,null,null,null,null,null,null,null,null,null,"Vracht"]
[null,null,null,null,null,null,null,null,null,null,null,null,null,null,null,null,"Motor"]
[null,null,null,null,null,null,null,null,null,null,null,null,null,null,null,null,"Obstakel / overig"]
[null,null,null,null,null,null,null,null,null,null,null,null,null,null,null,null,"Fout personenwagen"]
[null,null,null,null,null,null,null,null,null,null,null,null,null,null,null,null,"Fout Vracht"]
[]
[]
[]
[]
[]
[]
[]
[]
[]
[]
[]
[null,"Opmerking"]
[null,"Het onderzoek vindt plaats gedurende coronamaatregelen."]
[null,"Dit heeft mogelijk een effect op de resultaten."]
[]
[null,"Toelichting"]
[null,"Pers = personenwagens op daarvoor bestemde"]
[null,"          openbare plaatsen"]
[null,"Vracht = vrachtwagens op daarvoor bestemde"]
[null,"          parkeerplaatsen (middel- en zwaar vrachtverkeer)"]
[null,"Motor = geparkeerde motoren op openbare plaatsen"]
[null,"Obstakel / overig = obstakels of overige voertuigen"]
[null,"          geparkeerd op openbare plaatsen"]
[null,"Fout pers = personenwagens die fout geparkeerd staan"]
[null,"Fout vracht = vrachtwagens die fout geparkeerd staan"]
[null,"E-wagen = geparkeerde elektrisch voertuig bij een"]
[null,"          elektrisch oplaadpunt"]
[null,"Invalide = personenwagens en motoren op voor"]
[null,"          invalide personen bestemde parkeerplaats"]
[null,"Gestalde fietsen = alle gestalde fietsen op de"]
[null,"          daarvoor bestemde parkeerplaatsen"]

{"sheet":"16.Breendonk (Puurs)","index":15,"n_rows":57,"n_cols":26,"rows_kept":57,"cut":false,"hidden":false,"merged":[[4,3,5,12],[4,16,5,16],[15,3,16,12]]}
[]
[null,"PARKEERONDERZOEK",null,"CARPOOLPARKINGS EN P+R PARKINGS"]
[null,16,null,{"$f":"B8 & \" - \"& TEXT(VLOOKUP(B3,Coordinaten!$A$2:$G$95,7,0),\"dddd dd mmmm jjjj\")","v":"Carpool parking Breendonk (Puurs), Puurs - donderdag 18 november 2021"}]
[null,{"$f":"VLOOKUP(B3,Coordinaten!$A$2:$G$95,6,0)","v":"51.060329, 4.334348"}]
[null,null,null,"BEZETTING  ",null,null,null,null,null,null,null,null,null,null,null,null,"OPMERKINGEN"]
[]
[null,"Onderzoeksgebied",null,"Datum","Geregistreerd tussen","Pers","Vracht","Motor","Obstakel / overig","Fout   pers","Fout Vracht","Totaal","E-wagen\nplaats","Invalidenplaats","Gestalde fietsen",null,null,null,null,null,{"$f":"F7","v":"Pers"},"Vracht","Motor","Obstakel / overig","Fout   pers","Fout Vracht"]
[null,{"$f":"VLOOKUP(B3,Coordinaten!$A$2:$G$95,3,0)&\", \"&VLOOKUP(B3,Coordinaten!$A$2:$G$95,5,0)","v":"Carpool parking Breendonk (Puurs), Puurs"},null,"2021-11-18","09:00 - 16:00u",31,8,0,2,0,4,45,0,0,0,null,0,null,{"$f":"D8","v":"2021-11-18"},{"$f":"E8","v":"09:00 - 16:00u"},{"$f":"IF(F8=0,NA(),F8/$L8)","v":0.68888888888888888},{"$f":"IF(G8=0,NA(),G8/$L8)","v":0.17777777777777778},{"$f":"IF(H8=0,NA(),H8/$L8)","v":{"$error":"#N/A"}},4.4444444444444446E-2,{"$error":"#N/A"},8.8888888888888892E-2]
[null,{"$f":"\"Nabij kruispunt: \"&VLOOKUP(B3,Coordinaten!$A$2:$L$95,4,0)","v":"Nabij kruispunt: N16 / N183"},null,null,null,0.68888888888888888,0.17777777777777778,"-",4.4444444444444446E-2,"-",8.8888888888888892E-2,1,null,null,null,null,0,null,{"$f":"D10","v":"2021-11-18"},{"$f":"E10","v":"19:00 - 02:00u"},{"$f":"IF(F10=0,NA(),F10/$L10)","v":0.1875},{"$f":"IF(G10=0,NA(),G10/$L10)","v":0.265625},{"$error":"#N/A"},{"$error":"#N/A"},{"$error":"#N/A"},0.546875]
[null,null,null,"2021-11-18","19:00 - 02:00u",12,17,0,0,0,35,64,0,0,0,null,"Fout vracht: de parking was bijna geheel vol. Veel vrachtwagens op"]
[null,"Meting",null,null,null,0.1875,0.265625,"-","-","-",0.546875,1,null,null,null,null,"autoparkeerplaatsen en langs de zijde geparkeerd"]
[null,{"$f":"\"Meetperiode: \"&TEXT(VLOOKUP(B3,Coordinaten!$A$2:$G$95,7,0),\"dddd dd mmmm jjjj\")","v":"Meetperiode: donderdag 18 november 2021"}]
[null,"Methodiek: Parkeerdrukmeting met waarnemers"]
[null,"In opdracht van: Vlaamse overheid"]
[null,"Uitgevoerd door: Dufec"]
[null,null,null,"VERDELING NAAR CATEGORIE"]
[null,"Locatie"]
[null,{"$f":"IF(B4=\"\",\"\",HYPERLINK(\"http://www.googlemaps.com/?q=\"&B4,\"Lat/Long: \"&B4))","v":"Lat/Long: 51.060329, 4.334348"}]
[]
[null,null,null,null,null,null,null,null,null,null,null,null,null,null,null,"Legenda"]
[null,null,null,null,null,null,null,null,null,null,null,null,null,null,null,null,"Personenwagen"]
[null,null,null,null,null,null,null,null,null,null,null,null,null,null,null,null,"Vracht"]
[null,null,null,null,null,null,null,null,null,null,null,null,null,null,null,null,"Motor"]
[null,null,null,null,null,null,null,null,null,null,null,null,null,null,null,null,"Obstakel / overig"]
[null,null,null,null,null,null,null,null,null,null,null,null,null,null,null,null,"Fout personenwagen"]
[null,null,null,null,null,null,null,null,null,null,null,null,null,null,null,null,"Fout Vracht"]
[]
[]
[]
[]
[]
[]
[]
[]
[]
[]
[]
[null,"Opmerking"]
[null,"Het onderzoek vindt plaats gedurende coronamaatregelen."]
[null,"Dit heeft mogelijk een effect op de resultaten."]
[]
[null,"Toelichting"]
[null,"Pers = personenwagens op daarvoor bestemde"]
[null,"          openbare plaatsen"]
[null,"Vracht = vrachtwagens op daarvoor bestemde"]
[null,"          parkeerplaatsen (middel- en zwaar vrachtverkeer)"]
[null,"Motor = geparkeerde motoren op openbare plaatsen"]
[null,"Obstakel / overig = obstakels of overige voertuigen"]
[null,"          geparkeerd op openbare plaatsen"]
[null,"Fout pers = personenwagens die fout geparkeerd staan"]
[null,"Fout vracht = vrachtwagens die fout geparkeerd staan"]
[null,"E-wagen = geparkeerde elektrisch voertuig bij een"]
[null,"          elektrisch oplaadpunt"]
[null,"Invalide = personenwagens en motoren op voor"]
[null,"          invalide personen bestemde parkeerplaats"]
[null,"Gestalde fietsen = alle gestalde fietsen op de"]
[null,"          daarvoor bestemde parkeerplaatsen"]

{"sheet":"17.Hasselt-Zuid","index":16,"n_rows":57,"n_cols":26,"rows_kept":57,"cut":false,"hidden":false,"merged":[[4,3,5,12],[4,16,5,16],[15,3,16,12]]}
[]
[null,"PARKEERONDERZOEK",null,"CARPOOLPARKINGS EN P+R PARKINGS"]
[null,17,null,{"$f":"B8 & \" - \"& TEXT(VLOOKUP(B3,Coordinaten!$A$2:$G$95,7,0),\"dddd dd mmmm jjjj\")","v":"Carpool parking Hasselt-Zuid, Hasselt - dinsdag 16 november 2021"}]
[null,{"$f":"VLOOKUP(B3,Coordinaten!$A$2:$G$95,6,0)","v":"50.915675, 5.322639"}]
[null,null,null,"BEZETTING  ",null,null,null,null,null,null,null,null,null,null,null,null,"OPMERKINGEN"]
[]
[null,"Onderzoeksgebied",null,"Datum","Geregistreerd tussen","Pers","Vracht","Motor","Obstakel / overig","Fout   pers","Fout Vracht","Totaal","E-wagen\nplaats","Invalidenplaats","Gestalde fietsen",null,null,null,null,null,{"$f":"F7","v":"Pers"},"Vracht","Motor","Obstakel / overig","Fout   pers","Fout Vracht"]
[null,{"$f":"VLOOKUP(B3,Coordinaten!$A$2:$G$95,3,0)&\", \"&VLOOKUP(B3,Coordinaten!$A$2:$G$95,5,0)","v":"Carpool parking Hasselt-Zuid, Hasselt"},null,"2021-11-16","09:00 - 16:00u",31,0,0,0,0,1,32,0,0,12,null,0,null,{"$f":"D8","v":"2021-11-16"},{"$f":"E8","v":"09:00 - 16:00u"},{"$f":"IF(F8=0,NA(),F8/$L8)","v":0.96875},{"$f":"IF(G8=0,NA(),G8/$L8)","v":{"$error":"#N/A"}},{"$f":"IF(H8=0,NA(),H8/$L8)","v":{"$error":"#N/A"}},{"$error":"#N/A"},{"$error":"#N/A"},3.125E-2]
[null,{"$f":"\"Nabij kruispunt: \"&VLOOKUP(B3,Coordinaten!$A$2:$L$95,4,0)","v":"Nabij kruispunt: N80 / A13"},null,null,null,0.96875,"-","-","-","-",3.125E-2,1,null,null,null,null,0,null,{"$f":"D10","v":"2021-11-16"},{"$f":"E10","v":"19:00 - 02:00u"},{"$f":"IF(F10=0,NA(),F10/$L10)","v":1},{"$f":"IF(G10=0,NA(),G10/$L10)","v":{"$error":"#N/A"}},{"$error":"#N/A"},{"$error":"#N/A"},{"$error":"#N/A"},{"$error":"#N/A"}]
[null,null,null,"2021-11-16","19:00 - 02:00u",20,0,0,0,0,0,20,0,0,3,null,0]
[null,"Meting",null,null,null,1,"-","-","-","-","-",1,null,null,null,null,0]
[null,{"$f":"\"Meetperiode: \"&TEXT(VLOOKUP(B3,Coordinaten!$A$2:$G$95,7,0),\"dddd dd mmmm jjjj\")","v":"Meetperiode: dinsdag 16 november 2021"}]
[null,"Methodiek: Parkeerdrukmeting met waarnemers"]
[null,"In opdracht van: Vlaamse overheid"]
[null,"Uitgevoerd door: Dufec"]
[null,null,null,"VERDELING NAAR CATEGORIE"]
[null,"Locatie"]
[null,{"$f":"IF(B4=\"\",\"\",HYPERLINK(\"http://www.googlemaps.com/?q=\"&B4,\"Lat/Long: \"&B4))","v":"Lat/Long: 50.915675, 5.322639"}]
[]
[null,null,null,null,null,null,null,null,null,null,null,null,null,null,null,"Legenda"]
[null,null,null,null,null,null,null,null,null,null,null,null,null,null,null,null,"Personenwagen"]
[null,null,null,null,null,null,null,null,null,null,null,null,null,null,null,null,"Vracht"]
[null,null,null,null,null,null,null,null,null,null,null,null,null,null,null,null,"Motor"]
[null,null,null,null,null,null,null,null,null,null,null,null,null,null,null,null,"Obstakel / overig"]
[null,null,null,null,null,null,null,null,null,null,null,null,null,null,null,null,"Fout personenwagen"]
[null,null,null,null,null,null,null,null,null,null,null,null,null,null,null,null,"Fout Vracht"]
[]
[]
[]
[]
[]
[]
[]
[]
[]
[]
[]
[null,"Opmerking"]
[null,"Het onderzoek vindt plaats gedurende coronamaatregelen."]
[null,"Dit heeft mogelijk een effect op de resultaten."]
[]
[null,"Toelichting"]
[null,"Pers = personenwagens op daarvoor bestemde"]
[null,"          openbare plaatsen"]
[null,"Vracht = vrachtwagens op daarvoor bestemde"]
[null,"          parkeerplaatsen (middel- en zwaar vrachtverkeer)"]
[null,"Motor = geparkeerde motoren op openbare plaatsen"]
[null,"Obstakel / overig = obstakels of overige voertuigen"]
[null,"          geparkeerd op openbare plaatsen"]
[null,"Fout pers = personenwagens die fout geparkeerd staan"]
[null,"Fout vracht = vrachtwagens die fout geparkeerd staan"]
[null,"E-wagen = geparkeerde elektrisch voertuig bij een"]
[null,"          elektrisch oplaadpunt"]
[null,"Invalide = personenwagens en motoren op voor"]
[null,"          invalide personen bestemde parkeerplaats"]
[null,"Gestalde fietsen = alle gestalde fietsen op de"]
[null,"          daarvoor bestemde parkeerplaatsen"]

{"sheet":"18.Herentals-West","index":17,"n_rows":57,"n_cols":26,"rows_kept":57,"cut":false,"hidden":false,"merged":[[4,3,5,12],[4,16,5,16],[15,3,16,12]]}
[]
[null,"PARKEERONDERZOEK",null,"CARPOOLPARKINGS EN P+R PARKINGS"]
[null,18,null,{"$f":"B8 & \" - \"& TEXT(VLOOKUP(B3,Coordinaten!$A$2:$G$95,7,0),\"dddd dd mmmm jjjj\")","v":"Carpool parking Herentals-West, Grobbendonk - donderdag 18 november 2021"}]
[null,{"$f":"VLOOKUP(B3,Coordinaten!$A$2:$G$95,6,0)","v":"51.175093, 4.761781"}]
[null,null,null,"BEZETTING  ",null,null,null,null,null,null,null,null,null,null,null,null,"OPMERKINGEN"]
[]
[null,"Onderzoeksgebied",null,"Datum","Geregistreerd tussen","Pers","Vracht","Motor","Obstakel / overig","Fout   pers","Fout Vracht","Totaal","E-wagen\nplaats","Invalidenplaats","Gestalde fietsen",null,null,null,null,null,{"$f":"F7","v":"Pers"},"Vracht","Motor","Obstakel / overig","Fout   pers","Fout Vracht"]
[null,{"$f":"VLOOKUP(B3,Coordinaten!$A$2:$G$95,3,0)&\", \"&VLOOKUP(B3,Coordinaten!$A$2:$G$95,5,0)","v":"Carpool parking Herentals-West, Grobbendonk"},null,"2021-11-18","09:00 - 16:00u",40,0,1,0,2,0,43,0,0,0,null,0,null,{"$f":"D8","v":"2021-11-18"},{"$f":"E8","v":"09:00 - 16:00u"},{"$f":"IF(F8=0,NA(),F8/$L8)","v":0.93023255813953487},{"$f":"IF(G8=0,NA(),G8/$L8)","v":{"$error":"#N/A"}},{"$f":"IF(H8=0,NA(),H8/$L8)","v":2.3255813953488372E-2},{"$error":"#N/A"},4.6511627906976744E-2,{"$error":"#N/A"}]
[null,{"$f":"\"Nabij kruispunt: \"&VLOOKUP(B3,Coordinaten!$A$2:$L$95,4,0)","v":"Nabij kruispunt: N13 / A13"},null,null,null,0.93023255813953487,"-",2.3255813953488372E-2,"-",4.6511627906976744E-2,"-",1,null,null,null,null,0,null,{"$f":"D10","v":"2021-11-18"},{"$f":"E10","v":"19:00 - 02:00u"},{"$f":"IF(F10=0,NA(),F10/$L10)","v":1},{"$f":"IF(G10=0,NA(),G10/$L10)","v":{"$error":"#N/A"}},{"$error":"#N/A"},{"$error":"#N/A"},{"$error":"#N/A"},{"$error":"#N/A"}]
[null,null,null,"2021-11-18","19:00 - 02:00u",13,0,0,0,0,0,13,0,0,0,null,0]
[null,"Meting",null,null,null,1,"-","-","-","-","-",1,null,null,null,null,0]
[null,{"$f":"\"Meetperiode: \"&TEXT(VLOOKUP(B3,Coordinaten!$A$2:$G$95,7,0),\"dddd dd mmmm jjjj\")","v":"Meetperiode: donderdag 18 november 2021"}]
[null,"Methodiek: Parkeerdrukmeting met waarnemers"]
[null,"In opdracht van: Vlaamse overheid"]
[null,"Uitgevoerd door: Dufec"]
[null,null,null,"VERDELING NAAR CATEGORIE"]
[null,"Locatie"]
[null,{"$f":"IF(B4=\"\",\"\",HYPERLINK(\"http://www.googlemaps.com/?q=\"&B4,\"Lat/Long: \"&B4))","v":"Lat/Long: 51.175093, 4.761781"}]
[]
[null,null,null,null,null,null,null,null,null,null,null,null,null,null,null,"Legenda"]
[null,null,null,null,null,null,null,null,null,null,null,null,null,null,null,null,"Personenwagen"]
[null,null,null,null,null,null,null,null,null,null,null,null,null,null,null,null,"Vracht"]
[null,null,null,null,null,null,null,null,null,null,null,null,null,null,null,null,"Motor"]
[null,null,null,null,null,null,null,null,null,null,null,null,null,null,null,null,"Obstakel / overig"]
[null,null,null,null,null,null,null,null,null,null,null,null,null,null,null,null,"Fout personenwagen"]
[null,null,null,null,null,null,null,null,null,null,null,null,null,null,null,null,"Fout Vracht"]
[]
[]
[]
[]
[]
[]
[]
[]
[]
[]
[]
[null,"Opmerking"]
[null,"Het onderzoek vindt plaats gedurende coronamaatregelen."]
[null,"Dit heeft mogelijk een effect op de resultaten."]
[]
[null,"Toelichting"]
[null,"Pers = personenwagens op daarvoor bestemde"]
[null,"          openbare plaatsen"]
[null,"Vracht = vrachtwagens op daarvoor bestemde"]
[null,"          parkeerplaatsen (middel- en zwaar vrachtverkeer)"]
[null,"Motor = geparkeerde motoren op openbare plaatsen"]
[null,"Obstakel / overig = obstakels of overige voertuigen"]
[null,"          geparkeerd op openbare plaatsen"]
[null,"Fout pers = personenwagens die fout geparkeerd staan"]
[null,"Fout vracht = vrachtwagens die fout geparkeerd staan"]
[null,"E-wagen = geparkeerde elektrisch voertuig bij een"]
[null,"          elektrisch oplaadpunt"]
[null,"Invalide = personenwagens en motoren op voor"]
[null,"          invalide personen bestemde parkeerplaats"]
[null,"Gestalde fietsen = alle gestalde fietsen op de"]
[null,"          daarvoor bestemde parkeerplaatsen"]

{"sheet":"19.Rumst","index":18,"n_rows":57,"n_cols":26,"rows_kept":57,"cut":false,"hidden":false,"merged":[[4,3,5,12],[4,16,5,16],[15,3,16,12]]}
[]
[null,"PARKEERONDERZOEK",null,"CARPOOLPARKINGS EN P+R PARKINGS"]
[null,19,null,{"$f":"B8 & \" - \"& TEXT(VLOOKUP(B3,Coordinaten!$A$2:$G$95,7,0),\"dddd dd mmmm jjjj\")","v":"Carpool parking Rumst, Rumst - donderdag 18 november 2021"}]
[null,{"$f":"VLOOKUP(B3,Coordinaten!$A$2:$G$95,6,0)","v":"51.085447, 4.444751"}]
[null,null,null,"BEZETTING  ",null,null,null,null,null,null,null,null,null,null,null,null,"OPMERKINGEN"]
[]
[null,"Onderzoeksgebied",null,"Datum","Geregistreerd tussen","Pers","Vracht","Motor","Obstakel / overig","Fout   pers","Fout Vracht","Totaal","E-wagen\nplaats","Invalidenplaats","Gestalde fietsen",null,null,null,null,null,{"$f":"F7","v":"Pers"},"Vracht","Motor","Obstakel / overig","Fout   pers","Fout Vracht"]
[null,{"$f":"VLOOKUP(B3,Coordinaten!$A$2:$G$95,3,0)&\", \"&VLOOKUP(B3,Coordinaten!$A$2:$G$95,5,0)","v":"Carpool parking Rumst, Rumst"},null,"2021-11-18","09:00 - 16:00u",40,0,0,3,0,0,43,0,0,0,null,"Obstakel: 2 aanhagers, 1 camper",null,{"$f":"D8","v":"2021-11-18"},{"$f":"E8","v":"09:00 - 16:00u"},{"$f":"IF(F8=0,NA(),F8/$L8)","v":0.93023255813953487},{"$f":"IF(G8=0,NA(),G8/$L8)","v":{"$error":"#N/A"}},{"$f":"IF(H8=0,NA(),H8/$L8)","v":{"$error":"#N/A"}},6.9767441860465115E-2,{"$error":"#N/A"},{"$error":"#N/A"}]
[null,{"$f":"\"Nabij kruispunt: \"&VLOOKUP(B3,Coordinaten!$A$2:$L$95,4,0)","v":"Nabij kruispunt: N1c / A1"},null,null,null,0.93023255813953487,"-","-",6.9767441860465115E-2,"-","-",1,null,null,null,null,0,null,{"$f":"D10","v":"2021-11-18"},{"$f":"E10","v":"19:00 - 02:00u"},{"$f":"IF(F10=0,NA(),F10/$L10)","v":0.95},{"$f":"IF(G10=0,NA(),G10/$L10)","v":{"$error":"#N/A"}},{"$error":"#N/A"},{"$error":"#N/A"},{"$error":"#N/A"},0.05]
[null,null,null,"2021-11-18","19:00 - 02:00u",19,0,0,0,0,1,20,0,0,0,null,0]
[null,"Meting",null,null,null,0.95,"-","-","-","-",0.05,1,null,null,null,null,0]
[null,{"$f":"\"Meetperiode: \"&TEXT(VLOOKUP(B3,Coordinaten!$A$2:$G$95,7,0),\"dddd dd mmmm jjjj\")","v":"Meetperiode: donderdag 18 november 2021"}]
[null,"Methodiek: Parkeerdrukmeting met waarnemers"]
[null,"In opdracht van: Vlaamse overheid"]
[null,"Uitgevoerd door: Dufec"]
[null,null,null,"VERDELING NAAR CATEGORIE"]
[null,"Locatie"]
[null,{"$f":"IF(B4=\"\",\"\",HYPERLINK(\"http://www.googlemaps.com/?q=\"&B4,\"Lat/Long: \"&B4))","v":"Lat/Long: 51.085447, 4.444751"}]
[]
[null,null,null,null,null,null,null,null,null,null,null,null,null,null,null,"Legenda"]
[null,null,null,null,null,null,null,null,null,null,null,null,null,null,null,null,"Personenwagen"]
[null,null,null,null,null,null,null,null,null,null,null,null,null,null,null,null,"Vracht"]
[null,null,null,null,null,null,null,null,null,null,null,null,null,null,null,null,"Motor"]
[null,null,null,null,null,null,null,null,null,null,null,null,null,null,null,null,"Obstakel / overig"]
[null,null,null,null,null,null,null,null,null,null,null,null,null,null,null,null,"Fout personenwagen"]
[null,null,null,null,null,null,null,null,null,null,null,null,null,null,null,null,"Fout Vracht"]
[]
[]
[]
[]
[]
[]
[]
[]
[]
[]
[]
[null,"Opmerking"]
[null,"Het onderzoek vindt plaats gedurende coronamaatregelen."]
[null,"Dit heeft mogelijk een effect op de resultaten."]
[]
[null,"Toelichting"]
[null,"Pers = personenwagens op daarvoor bestemde"]
[null,"          openbare plaatsen"]
[null,"Vracht = vrachtwagens op daarvoor bestemde"]
[null,"          parkeerplaatsen (middel- en zwaar vrachtverkeer)"]
[null,"Motor = geparkeerde motoren op openbare plaatsen"]
[null,"Obstakel / overig = obstakels of overige voertuigen"]
[null,"          geparkeerd op openbare plaatsen"]
[null,"Fout pers = personenwagens die fout geparkeerd staan"]
[null,"Fout vracht = vrachtwagens die fout geparkeerd staan"]
[null,"E-wagen = geparkeerde elektrisch voertuig bij een"]
[null,"          elektrisch oplaadpunt"]
[null,"Invalide = personenwagens en motoren op voor"]
[null,"          invalide personen bestemde parkeerplaats"]
[null,"Gestalde fietsen = alle gestalde fietsen op de"]
[null,"          daarvoor bestemde parkeerplaatsen"]

{"sheet":"20.Paal","index":19,"n_rows":57,"n_cols":26,"rows_kept":57,"cut":false,"hidden":false,"merged":[[4,3,5,12],[4,16,5,16],[15,3,16,12]]}
[]
[null,"PARKEERONDERZOEK",null,"CARPOOLPARKINGS EN P+R PARKINGS"]
[null,20,null,{"$f":"B8 & \" - \"& TEXT(VLOOKUP(B3,Coordinaten!$A$2:$G$95,7,0),\"dddd dd mmmm jjjj\")","v":"Carpool parking Paal, Beringen - donderdag 18 november 2021"}]
[null,{"$f":"VLOOKUP(B3,Coordinaten!$A$2:$G$95,6,0)","v":"51.043187, 5.186305"}]
[null,null,null,"BEZETTING  ",null,null,null,null,null,null,null,null,null,null,null,null,"OPMERKINGEN"]
[]
[null,"Onderzoeksgebied",null,"Datum","Geregistreerd tussen","Pers","Vracht","Motor","Obstakel / overig","Fout   pers","Fout Vracht","Totaal","E-wagen\nplaats","Invalidenplaats","Gestalde fietsen",null,null,null,null,null,{"$f":"F7","v":"Pers"},"Vracht","Motor","Obstakel / overig","Fout   pers","Fout Vracht"]
[null,{"$f":"VLOOKUP(B3,Coordinaten!$A$2:$G$95,3,0)&\", \"&VLOOKUP(B3,Coordinaten!$A$2:$G$95,5,0)","v":"Carpool parking Paal, Beringen"},null,"2021-11-18","09:00 - 16:00u",54,0,0,0,0,1,55,0,0,2,null,0,null,{"$f":"D8","v":"2021-11-18"},{"$f":"E8","v":"09:00 - 16:00u"},{"$f":"IF(F8=0,NA(),F8/$L8)","v":0.98181818181818181},{"$f":"IF(G8=0,NA(),G8/$L8)","v":{"$error":"#N/A"}},{"$f":"IF(H8=0,NA(),H8/$L8)","v":{"$error":"#N/A"}},{"$error":"#N/A"},{"$error":"#N/A"},1.8181818181818181E-2]
[null,{"$f":"\"Nabij kruispunt: \"&VLOOKUP(B3,Coordinaten!$A$2:$L$95,4,0)","v":"Nabij kruispunt: N29 / A13"},null,null,null,0.98181818181818181,"-","-","-","-",1.8181818181818181E-2,1,null,null,null,null,0,null,{"$f":"D10","v":"2021-11-18"},{"$f":"E10","v":"19:00 - 02:00u"},{"$f":"IF(F10=0,NA(),F10/$L10)","v":1},{"$f":"IF(G10=0,NA(),G10/$L10)","v":{"$error":"#N/A"}},{"$error":"#N/A"},{"$error":"#N/A"},{"$error":"#N/A"},{"$error":"#N/A"}]
[null,null,null,"2021-11-18","19:00 - 02:00u",16,0,0,0,0,0,16,0,0,0,null,0]
[null,"Meting",null,null,null,1,"-","-","-","-","-",1,null,null,null,null,0]
[null,{"$f":"\"Meetperiode: \"&TEXT(VLOOKUP(B3,Coordinaten!$A$2:$G$95,7,0),\"dddd dd mmmm jjjj\")","v":"Meetperiode: donderdag 18 november 2021"}]
[null,"Methodiek: Parkeerdrukmeting met waarnemers"]
[null,"In opdracht van: Vlaamse overheid"]
[null,"Uitgevoerd door: Dufec"]
[null,null,null,"VERDELING NAAR CATEGORIE"]
[null,"Locatie"]
[null,{"$f":"IF(B4=\"\",\"\",HYPERLINK(\"http://www.googlemaps.com/?q=\"&B4,\"Lat/Long: \"&B4))","v":"Lat/Long: 51.043187, 5.186305"}]
[]
[null,null,null,null,null,null,null,null,null,null,null,null,null,null,null,"Legenda"]
[null,null,null,null,null,null,null,null,null,null,null,null,null,null,null,null,"Personenwagen"]
[null,null,null,null,null,null,null,null,null,null,null,null,null,null,null,null,"Vracht"]
[null,null,null,null,null,null,null,null,null,null,null,null,null,null,null,null,"Motor"]
[null,null,null,null,null,null,null,null,null,null,null,null,null,null,null,null,"Obstakel / overig"]
[null,null,null,null,null,null,null,null,null,null,null,null,null,null,null,null,"Fout personenwagen"]
[null,null,null,null,null,null,null,null,null,null,null,null,null,null,null,null,"Fout Vracht"]
[]
[]
[]
[]
[]
[]
[]
[]
[]
[]
[]
[null,"Opmerking"]
[null,"Het onderzoek vindt plaats gedurende coronamaatregelen."]
[null,"Dit heeft mogelijk een effect op de resultaten."]
[]
[null,"Toelichting"]
[null,"Pers = personenwagens op daarvoor bestemde"]
[null,"          openbare plaatsen"]
[null,"Vracht = vrachtwagens op daarvoor bestemde"]
[null,"          parkeerplaatsen (middel- en zwaar vrachtverkeer)"]
[null,"Motor = geparkeerde motoren op openbare plaatsen"]
[null,"Obstakel / overig = obstakels of overige voertuigen"]
[null,"          geparkeerd op openbare plaatsen"]
[null,"Fout pers = personenwagens die fout geparkeerd staan"]
[null,"Fout vracht = vrachtwagens die fout geparkeerd staan"]
[null,"E-wagen = geparkeerde elektrisch voertuig bij een"]
[null,"          elektrisch oplaadpunt"]
[null,"Invalide = personenwagens en motoren op voor"]
[null,"          invalide personen bestemde parkeerplaats"]
[null,"Gestalde fietsen = alle gestalde fietsen op de"]
[null,"          daarvoor bestemde parkeerplaatsen"]

{"sheet":"21.Lummen","index":20,"n_rows":57,"n_cols":26,"rows_kept":57,"cut":false,"hidden":false,"merged":[[4,3,5,12],[4,16,5,16],[15,3,16,12]]}
[]
[null,"PARKEERONDERZOEK",null,"CARPOOLPARKINGS EN P+R PARKINGS"]
[null,21,null,{"$f":"B8 & \" - \"& TEXT(VLOOKUP(B3,Coordinaten!$A$2:$G$95,7,0),\"dddd dd mmmm jjjj\")","v":"Carpool parking Lummen, Lummen - dinsdag 16 november 2021"}]
[null,{"$f":"VLOOKUP(B3,Coordinaten!$A$2:$G$95,6,0)","v":"50.997621, 5.197778"}]
[null,null,null,"BEZETTING  ",null,null,null,null,null,null,null,null,null,null,null,null,"OPMERKINGEN"]
[]
[null,"Onderzoeksgebied",null,"Datum","Geregistreerd tussen","Pers","Vracht","Motor","Obstakel / overig","Fout   pers","Fout Vracht","Totaal","E-wagen\nplaats","Invalidenplaats","Gestalde fietsen",null,null,null,null,null,{"$f":"F7","v":"Pers"},"Vracht","Motor","Obstakel / overig","Fout   pers","Fout Vracht"]
[null,{"$f":"VLOOKUP(B3,Coordinaten!$A$2:$G$95,3,0)&\", \"&VLOOKUP(B3,Coordinaten!$A$2:$G$95,5,0)","v":"Carpool parking Lummen, Lummen"},null,"2021-11-16","09:00 - 16:00u",156,0,0,0,0,1,157,0,0,2,null,0,null,{"$f":"D8","v":"2021-11-16"},{"$f":"E8","v":"09:00 - 16:00u"},{"$f":"IF(F8=0,NA(),F8/$L8)","v":0.99363057324840764},{"$f":"IF(G8=0,NA(),G8/$L8)","v":{"$error":"#N/A"}},{"$f":"IF(H8=0,NA(),H8/$L8)","v":{"$error":"#N/A"}},{"$error":"#N/A"},{"$error":"#N/A"},6.369426751592357E-3]
[null,{"$f":"\"Nabij kruispunt: \"&VLOOKUP(B3,Coordinaten!$A$2:$L$95,4,0)","v":"Nabij kruispunt: N717 / A2"},null,null,null,0.99363057324840764,"-","-","-","-",6.369426751592357E-3,1,null,null,null,null,0,null,{"$f":"D10","v":"2021-11-16"},{"$f":"E10","v":"19:00 - 02:00u"},{"$f":"IF(F10=0,NA(),F10/$L10)","v":1},{"$f":"IF(G10=0,NA(),G10/$L10)","v":{"$error":"#N/A"}},{"$error":"#N/A"},{"$error":"#N/A"},{"$error":"#N/A"},{"$error":"#N/A"}]
[null,null,null,"2021-11-16","19:00 - 02:00u",28,0,0,0,0,0,28,0,0,5,null,0]
[null,"Meting",null,null,null,1,"-","-","-","-","-",1,null,null,null,null,0]
[null,{"$f":"\"Meetperiode: \"&TEXT(VLOOKUP(B3,Coordinaten!$A$2:$G$95,7,0),\"dddd dd mmmm jjjj\")","v":"Meetperiode: dinsdag 16 november 2021"}]
[null,"Methodiek: Parkeerdrukmeting met waarnemers"]
[null,"In opdracht van: Vlaamse overheid"]
[null,"Uitgevoerd door: Dufec"]
[null,null,null,"VERDELING NAAR CATEGORIE"]
[null,"Locatie"]
[null,{"$f":"IF(B4=\"\",\"\",HYPERLINK(\"http://www.googlemaps.com/?q=\"&B4,\"Lat/Long: \"&B4))","v":"Lat/Long: 50.997621, 5.197778"}]
[]
[null,null,null,null,null,null,null,null,null,null,null,null,null,null,null,"Legenda"]
[null,null,null,null,null,null,null,null,null,null,null,null,null,null,null,null,"Personenwagen"]
[null,null,null,null,null,null,null,null,null,null,null,null,null,null,null,null,"Vracht"]
[null,null,null,null,null,null,null,null,null,null,null,null,null,null,null,null,"Motor"]
[null,null,null,null,null,null,null,null,null,null,null,null,null,null,null,null,"Obstakel / overig"]
[null,null,null,null,null,null,null,null,null,null,null,null,null,null,null,null,"Fout personenwagen"]
[null,null,null,null,null,null,null,null,null,null,null,null,null,null,null,null,"Fout Vracht"]
[]
[]
[]
[]
[]
[]
[]
[]
[]
[]
[]
[null,"Opmerking"]
[null,"Het onderzoek vindt plaats gedurende coronamaatregelen."]
[null,"Dit heeft mogelijk een effect op de resultaten."]
[]
[null,"Toelichting"]
[null,"Pers = personenwagens op daarvoor bestemde"]
[null,"          openbare plaatsen"]
[null,"Vracht = vrachtwagens op daarvoor bestemde"]
[null,"          parkeerplaatsen (middel- en zwaar vrachtverkeer)"]
[null,"Motor = geparkeerde motoren op openbare plaatsen"]
[null,"Obstakel / overig = obstakels of overige voertuigen"]
[null,"          geparkeerd op openbare plaatsen"]
[null,"Fout pers = personenwagens die fout geparkeerd staan"]
[null,"Fout vracht = vrachtwagens die fout geparkeerd staan"]
[null,"E-wagen = geparkeerde elektrisch voertuig bij een"]
[null,"          elektrisch oplaadpunt"]
[null,"Invalide = personenwagens en motoren op voor"]
[null,"          invalide personen bestemde parkeerplaats"]
[null,"Gestalde fietsen = alle gestalde fietsen op de"]
[null,"          daarvoor bestemde parkeerplaatsen"]

{"sheet":"22.Halen","index":21,"n_rows":57,"n_cols":26,"rows_kept":57,"cut":false,"hidden":false,"merged":[[4,3,5,12],[4,16,5,16],[15,3,16,12]]}
[]
[null,"PARKEERONDERZOEK",null,"CARPOOLPARKINGS EN P+R PARKINGS"]
[null,22,null,{"$f":"B8 & \" - \"& TEXT(VLOOKUP(B3,Coordinaten!$A$2:$G$95,7,0),\"dddd dd mmmm jjjj\")","v":"Carpool parking Halen, Halen - dinsdag 16 november 2021"}]
[null,{"$f":"VLOOKUP(B3,Coordinaten!$A$2:$G$95,6,0)","v":"50.962073, 5.083806"}]
[null,null,null,"BEZETTING  ",null,null,null,null,null,null,null,null,null,null,null,null,"OPMERKINGEN"]
[]
[null,"Onderzoeksgebied",null,"Datum","Geregistreerd tussen","Pers","Vracht","Motor","Obstakel / overig","Fout   pers","Fout Vracht","Totaal","E-wagen\nplaats","Invalidenplaats","Gestalde fietsen",null,null,null,null,null,{"$f":"F7","v":"Pers"},"Vracht","Motor","Obstakel / overig","Fout   pers","Fout Vracht"]
[null,{"$f":"VLOOKUP(B3,Coordinaten!$A$2:$G$95,3,0)&\", \"&VLOOKUP(B3,Coordinaten!$A$2:$G$95,5,0)","v":"Carpool parking Halen, Halen"},null,"2021-11-16","09:00 - 16:00u",35,0,0,1,0,1,37,0,0,0,null,"Obstakel: aanhanger",null,{"$f":"D8","v":"2021-11-16"},{"$f":"E8","v":"09:00 - 16:00u"},{"$f":"IF(F8=0,NA(),F8/$L8)","v":0.94594594594594594},{"$f":"IF(G8=0,NA(),G8/$L8)","v":{"$error":"#N/A"}},{"$f":"IF(H8=0,NA(),H8/$L8)","v":{"$error":"#N/A"}},2.7027027027027029E-2,{"$error":"#N/A"},2.7027027027027029E-2]
[null,{"$f":"\"Nabij kruispunt: \"&VLOOKUP(B3,Coordinaten!$A$2:$L$95,4,0)","v":"Nabij kruispunt: N2 / A2"},null,null,null,0.94594594594594594,"-","-",2.7027027027027029E-2,"-",2.7027027027027029E-2,1,null,null,null,null,0,null,{"$f":"D10","v":"2021-11-16"},{"$f":"E10","v":"19:00 - 02:00u"},{"$f":"IF(F10=0,NA(),F10/$L10)","v":1},{"$f":"IF(G10=0,NA(),G10/$L10)","v":{"$error":"#N/A"}},{"$error":"#N/A"},{"$error":"#N/A"},{"$error":"#N/A"},{"$error":"#N/A"}]
[null,null,null,"2021-11-16","19:00 - 02:00u",5,0,0,0,0,0,5,0,0,0,null,0]
[null,"Meting",null,null,null,1,"-","-","-","-","-",1,null,null,null,null,0]
[null,{"$f":"\"Meetperiode: \"&TEXT(VLOOKUP(B3,Coordinaten!$A$2:$G$95,7,0),\"dddd dd mmmm jjjj\")","v":"Meetperiode: dinsdag 16 november 2021"}]
[null,"Methodiek: Parkeerdrukmeting met waarnemers"]
[null,"In opdracht van: Vlaamse overheid"]
[null,"Uitgevoerd door: Dufec"]
[null,null,null,"VERDELING NAAR CATEGORIE"]
[null,"Locatie"]
[null,{"$f":"IF(B4=\"\",\"\",HYPERLINK(\"http://www.googlemaps.com/?q=\"&B4,\"Lat/Long: \"&B4))","v":"Lat/Long: 50.962073, 5.083806"}]
[]
[null,null,null,null,null,null,null,null,null,null,null,null,null,null,null,"Legenda"]
[null,null,null,null,null,null,null,null,null,null,null,null,null,null,null,null,"Personenwagen"]
[null,null,null,null,null,null,null,null,null,null,null,null,null,null,null,null,"Vracht"]
[null,null,null,null,null,null,null,null,null,null,null,null,null,null,null,null,"Motor"]
[null,null,null,null,null,null,null,null,null,null,null,null,null,null,null,null,"Obstakel / overig"]
[null,null,null,null,null,null,null,null,null,null,null,null,null,null,null,null,"Fout personenwagen"]
[null,null,null,null,null,null,null,null,null,null,null,null,null,null,null,null,"Fout Vracht"]
[]
[]
[]
[]
[]
[]
[]
[]
[]
[]
[]
[null,"Opmerking"]
[null,"Het onderzoek vindt plaats gedurende coronamaatregelen."]
[null,"Dit heeft mogelijk een effect op de resultaten."]
[]
[null,"Toelichting"]
[null,"Pers = personenwagens op daarvoor bestemde"]
[null,"          openbare plaatsen"]
[null,"Vracht = vrachtwagens op daarvoor bestemde"]
[null,"          parkeerplaatsen (middel- en zwaar vrachtverkeer)"]
[null,"Motor = geparkeerde motoren op openbare plaatsen"]
[null,"Obstakel / overig = obstakels of overige voertuigen"]
[null,"          geparkeerd op openbare plaatsen"]
[null,"Fout pers = personenwagens die fout geparkeerd staan"]
[null,"Fout vracht = vrachtwagens die fout geparkeerd staan"]
[null,"E-wagen = geparkeerde elektrisch voertuig bij een"]
[null,"          elektrisch oplaadpunt"]
[null,"Invalide = personenwagens en motoren op voor"]
[null,"          invalide personen bestemde parkeerplaats"]
[null,"Gestalde fietsen = alle gestalde fietsen op de"]
[null,"          daarvoor bestemde parkeerplaatsen"]

{"sheet":"23.Maasmechelen","index":22,"n_rows":57,"n_cols":26,"rows_kept":57,"cut":false,"hidden":false,"merged":[[4,3,5,12],[4,16,5,16],[15,3,16,12]]}
[]
[null,"PARKEERONDERZOEK",null,"CARPOOLPARKINGS EN P+R PARKINGS"]
[null,23,null,{"$f":"B8 & \" - \"& TEXT(VLOOKUP(B3,Coordinaten!$A$2:$G$95,7,0),\"dddd dd mmmm jjjj\")","v":"Carpool parking Maasmechelen, Maasmechelen - dinsdag 16 november 2021"}]
[null,{"$f":"VLOOKUP(B3,Coordinaten!$A$2:$G$95,6,0)","v":"50.954058, 5.694835"}]
[null,null,null,"BEZETTING  ",null,null,null,null,null,null,null,null,null,null,null,null,"OPMERKINGEN"]
[]
[null,"Onderzoeksgebied",null,"Datum","Geregistreerd tussen","Pers","Vracht","Motor","Obstakel / overig","Fout   pers","Fout Vracht","Totaal","E-wagen\nplaats","Invalidenplaats","Gestalde fietsen",null,null,null,null,null,{"$f":"F7","v":"Pers"},"Vracht","Motor","Obstakel / overig","Fout   pers","Fout Vracht"]
[null,{"$f":"VLOOKUP(B3,Coordinaten!$A$2:$G$95,3,0)&\", \"&VLOOKUP(B3,Coordinaten!$A$2:$G$95,5,0)","v":"Carpool parking Maasmechelen, Maasmechelen"},null,"2021-11-16","09:00 - 16:00u",54,0,0,0,0,0,54,0,0,0,null,0,null,{"$f":"D8","v":"2021-11-16"},{"$f":"E8","v":"09:00 - 16:00u"},{"$f":"IF(F8=0,NA(),F8/$L8)","v":1},{"$f":"IF(G8=0,NA(),G8/$L8)","v":{"$error":"#N/A"}},{"$f":"IF(H8=0,NA(),H8/$L8)","v":{"$error":"#N/A"}},{"$error":"#N/A"},{"$error":"#N/A"},{"$error":"#N/A"}]
[null,{"$f":"\"Nabij kruispunt: \"&VLOOKUP(B3,Coordinaten!$A$2:$L$95,4,0)","v":"Nabij kruispunt: N78 / E314"},null,null,null,1,"-","-","-","-","-",1,null,null,null,null,0,null,{"$f":"D10","v":"2021-11-16"},{"$f":"E10","v":"19:00 - 02:00u"},{"$f":"IF(F10=0,NA(),F10/$L10)","v":1},{"$f":"IF(G10=0,NA(),G10/$L10)","v":{"$error":"#N/A"}},{"$error":"#N/A"},{"$error":"#N/A"},{"$error":"#N/A"},{"$error":"#N/A"}]
[null,null,null,"2021-11-16","19:00 - 02:00u",29,0,0,0,0,0,29,0,0,0,null,0]
[null,"Meting",null,null,null,1,"-","-","-","-","-",1,null,null,null,null,0]
[null,{"$f":"\"Meetperiode: \"&TEXT(VLOOKUP(B3,Coordinaten!$A$2:$G$95,7,0),\"dddd dd mmmm jjjj\")","v":"Meetperiode: dinsdag 16 november 2021"}]
[null,"Methodiek: Parkeerdrukmeting met waarnemers"]
[null,"In opdracht van: Vlaamse overheid"]
[null,"Uitgevoerd door: Dufec"]
[null,null,null,"VERDELING NAAR CATEGORIE"]
[null,"Locatie"]
[null,{"$f":"IF(B4=\"\",\"\",HYPERLINK(\"http://www.googlemaps.com/?q=\"&B4,\"Lat/Long: \"&B4))","v":"Lat/Long: 50.954058, 5.694835"}]
[]
[null,null,null,null,null,null,null,null,null,null,null,null,null,null,null,"Legenda"]
[null,null,null,null,null,null,null,null,null,null,null,null,null,null,null,null,"Personenwagen"]
[null,null,null,null,null,null,null,null,null,null,null,null,null,null,null,null,"Vracht"]
[null,null,null,null,null,null,null,null,null,null,null,null,null,null,null,null,"Motor"]
[null,null,null,null,null,null,null,null,null,null,null,null,null,null,null,null,"Obstakel / overig"]
[null,null,null,null,null,null,null,null,null,null,null,null,null,null,null,null,"Fout personenwagen"]
[null,null,null,null,null,null,null,null,null,null,null,null,null,null,null,null,"Fout Vracht"]
[]
[]
[]
[]
[]
[]
[]
[]
[]
[]
[]
[null,"Opmerking"]
[null,"Het onderzoek vindt plaats gedurende coronamaatregelen."]
[null,"Dit heeft mogelijk een effect op de resultaten."]
[]
[null,"Toelichting"]
[null,"Pers = personenwagens op daarvoor bestemde"]
[null,"          openbare plaatsen"]
[null,"Vracht = vrachtwagens op daarvoor bestemde"]
[null,"          parkeerplaatsen (middel- en zwaar vrachtverkeer)"]
[null,"Motor = geparkeerde motoren op openbare plaatsen"]
[null,"Obstakel / overig = obstakels of overige voertuigen"]
[null,"          geparkeerd op openbare plaatsen"]
[null,"Fout pers = personenwagens die fout geparkeerd staan"]
[null,"Fout vracht = vrachtwagens die fout geparkeerd staan"]
[null,"E-wagen = geparkeerde elektrisch voertuig bij een"]
[null,"          elektrisch oplaadpunt"]
[null,"Invalide = personenwagens en motoren op voor"]
[null,"          invalide personen bestemde parkeerplaats"]
[null,"Gestalde fietsen = alle gestalde fietsen op de"]
[null,"          daarvoor bestemde parkeerplaatsen"]

{"sheet":"24.Gentbrugge Arsenaal","index":23,"n_rows":57,"n_cols":26,"rows_kept":57,"cut":false,"hidden":false,"merged":[[4,3,5,12],[4,16,5,16],[15,3,16,12]]}
[]
[null,"PARKEERONDERZOEK",null,"CARPOOLPARKINGS EN P+R PARKINGS"]
[null,24,null,{"$f":"B8 & \" - \"& TEXT(VLOOKUP(B3,Coordinaten!$A$2:$G$95,7,0),\"dddd dd mmmm jjjj\")","v":"P+R parking Gentbrugge Arsenaal, Gent - dinsdag 23 november 2021"}]
[null,{"$f":"VLOOKUP(B3,Coordinaten!$A$2:$G$95,6,0)","v":"51.032277, 3.758713"}]
[null,null,null,"BEZETTING  ",null,null,null,null,null,null,null,null,null,null,null,null,"OPMERKINGEN"]
[]
[null,"Onderzoeksgebied",null,"Datum","Geregistreerd tussen","Pers","Vracht","Motor","Obstakel / overig","Fout   pers","Fout Vracht","Totaal","E-wagen\nplaats","Invalidenplaats","Gestalde fietsen",null,null,null,null,null,{"$f":"F7","v":"Pers"},"Vracht","Motor","Obstakel / overig","Fout   pers","Fout Vracht"]
[null,{"$f":"VLOOKUP(B3,Coordinaten!$A$2:$G$95,3,0)&\", \"&VLOOKUP(B3,Coordinaten!$A$2:$G$95,5,0)","v":"P+R parking Gentbrugge Arsenaal, Gent"},null,"2021-11-23","09:00 - 16:00u",247,0,0,3,18,0,268,0,0,55,null,"Vanaf 20 november nieuwe coronamaatregelen, waaronder verplicht telewerk",null,{"$f":"D8","v":"2021-11-23"},{"$f":"E8","v":"09:00 - 16:00u"},{"$f":"IF(F8=0,NA(),F8/$L8)","v":0.92164179104477617},{"$f":"IF(G8=0,NA(),G8/$L8)","v":{"$error":"#N/A"}},{"$f":"IF(H8=0,NA(),H8/$L8)","v":{"$error":"#N/A"}},1.1194029850746268E-2,6.7164179104477612E-2,{"$error":"#N/A"}]
[null,{"$f":"\"Nabij kruispunt: \"&VLOOKUP(B3,Coordinaten!$A$2:$L$95,4,0)","v":"Nabij kruispunt: N9 / Jules de Saint-Genoisstraat"},null,null,null,0.92164179104477617,"-","-",1.1194029850746268E-2,6.7164179104477612E-2,"-",1,null,null,null,null,"Obstakel: 3 caravans",null,{"$f":"D10","v":"2021-11-23"},{"$f":"E10","v":"19:00 - 02:00u"},{"$f":"IF(F10=0,NA(),F10/$L10)","v":0.98342541436464093},{"$f":"IF(G10=0,NA(),G10/$L10)","v":{"$error":"#N/A"}},{"$error":"#N/A"},1.6574585635359115E-2,{"$error":"#N/A"},{"$error":"#N/A"}]
[null,null,null,"2021-11-23","19:00 - 02:00u",178,0,0,3,0,0,181,0,4,60,null,"Vanaf 20 november nieuwe coronamaatregelen, waaronder verplicht telewerk"]
[null,"Meting",null,null,null,0.98342541436464093,"-","-",1.6574585635359115E-2,"-","-",1,null,null,null,null,"Obstakel: 3 caravans"]
[null,{"$f":"\"Meetperiode: \"&TEXT(VLOOKUP(B3,Coordinaten!$A$2:$G$95,7,0),\"dddd dd mmmm jjjj\")","v":"Meetperiode: dinsdag 23 november 2021"}]
[null,"Methodiek: Parkeerdrukmeting met waarnemers"]
[null,"In opdracht van: Vlaamse overheid"]
[null,"Uitgevoerd door: Dufec"]
[null,null,null,"VERDELING NAAR CATEGORIE"]
[null,"Locatie"]
[null,{"$f":"IF(B4=\"\",\"\",HYPERLINK(\"http://www.googlemaps.com/?q=\"&B4,\"Lat/Long: \"&B4))","v":"Lat/Long: 51.032277, 3.758713"}]
[]
[null,null,null,null,null,null,null,null,null,null,null,null,null,null,null,"Legenda"]
[null,null,null,null,null,null,null,null,null,null,null,null,null,null,null,null,"Personenwagen"]
[null,null,null,null,null,null,null,null,null,null,null,null,null,null,null,null,"Vracht"]
[null,null,null,null,null,null,null,null,null,null,null,null,null,null,null,null,"Motor"]
[null,null,null,null,null,null,null,null,null,null,null,null,null,null,null,null,"Obstakel / overig"]
[null,null,null,null,null,null,null,null,null,null,null,null,null,null,null,null,"Fout personenwagen"]
[null,null,null,null,null,null,null,null,null,null,null,null,null,null,null,null,"Fout Vracht"]
[]
[]
[]
[]
[]
[]
[]
[]
[]
[]
[]
[null,"Opmerking"]
[null,"Het onderzoek vindt plaats gedurende coronamaatregelen."]
[null,"Dit heeft mogelijk een effect op de resultaten."]
[]
[null,"Toelichting"]
[null,"Pers = personenwagens op daarvoor bestemde"]
[null,"          openbare plaatsen"]
[null,"Vracht = vrachtwagens op daarvoor bestemde"]
[null,"          parkeerplaatsen (middel- en zwaar vrachtverkeer)"]
[null,"Motor = geparkeerde motoren op openbare plaatsen"]
[null,"Obstakel / overig = obstakels of overige voertuigen"]
[null,"          geparkeerd op openbare plaatsen"]
[null,"Fout pers = personenwagens die fout geparkeerd staan"]
[null,"Fout vracht = vrachtwagens die fout geparkeerd staan"]
[null,"E-wagen = geparkeerde elektrisch voertuig bij een"]
[null,"          elektrisch oplaadpunt"]
[null,"Invalide = personenwagens en motoren op voor"]
[null,"          invalide personen bestemde parkeerplaats"]
[null,"Gestalde fietsen = alle gestalde fietsen op de"]
[null,"          daarvoor bestemde parkeerplaatsen"]

{"sheet":"25.Aalst-Zuid","index":24,"n_rows":57,"n_cols":26,"rows_kept":57,"cut":false,"hidden":false,"merged":[[4,3,5,12],[4,16,5,16],[15,3,16,12]]}
[]
[null,"PARKEERONDERZOEK",null,"CARPOOLPARKINGS EN P+R PARKINGS"]
[null,25,null,{"$f":"B8 & \" - \"& TEXT(VLOOKUP(B3,Coordinaten!$A$2:$G$95,7,0),\"dddd dd mmmm jjjj\")","v":"Carpool parking Aalst-Zuid, Aalst - dinsdag 23 november 2021"}]
[null,{"$f":"VLOOKUP(B3,Coordinaten!$A$2:$G$95,6,0)","v":"50.913372, 4.031872"}]
[null,null,null,"BEZETTING  ",null,null,null,null,null,null,null,null,null,null,null,null,"OPMERKINGEN"]
[]
[null,"Onderzoeksgebied",null,"Datum","Geregistreerd tussen","Pers","Vracht","Motor","Obstakel / overig","Fout   pers","Fout Vracht","Totaal","E-wagen\nplaats","Invalidenplaats","Gestalde fietsen",null,null,null,null,null,{"$f":"F7","v":"Pers"},"Vracht","Motor","Obstakel / overig","Fout   pers","Fout Vracht"]
[null,{"$f":"VLOOKUP(B3,Coordinaten!$A$2:$G$95,3,0)&\", \"&VLOOKUP(B3,Coordinaten!$A$2:$G$95,5,0)","v":"Carpool parking Aalst-Zuid, Aalst"},null,"2021-11-23","09:00 - 16:00u",25,0,0,0,0,0,25,0,0,0,null,"Vanaf 20 november nieuwe coronamaatregelen, waaronder verplicht telewerk",null,{"$f":"D8","v":"2021-11-23"},{"$f":"E8","v":"09:00 - 16:00u"},{"$f":"IF(F8=0,NA(),F8/$L8)","v":1},{"$f":"IF(G8=0,NA(),G8/$L8)","v":{"$error":"#N/A"}},{"$f":"IF(H8=0,NA(),H8/$L8)","v":{"$error":"#N/A"}},{"$error":"#N/A"},{"$error":"#N/A"},{"$error":"#N/A"}]
[null,{"$f":"\"Nabij kruispunt: \"&VLOOKUP(B3,Coordinaten!$A$2:$L$95,4,0)","v":"Nabij kruispunt: N45 / N460"},null,null,null,1,"-","-","-","-","-",1,null,null,null,null,0,null,{"$f":"D10","v":"2021-11-23"},{"$f":"E10","v":"19:00 - 02:00u"},{"$f":"IF(F10=0,NA(),F10/$L10)","v":1},{"$f":"IF(G10=0,NA(),G10/$L10)","v":{"$error":"#N/A"}},{"$error":"#N/A"},{"$error":"#N/A"},{"$error":"#N/A"},{"$error":"#N/A"}]
[null,null,null,"2021-11-23","19:00 - 02:00u",9,0,0,0,0,0,9,1,0,0,null,"Vanaf 20 november nieuwe coronamaatregelen, waaronder verplicht telewerk"]
[null,"Meting",null,null,null,1,"-","-","-","-","-",1,null,null,null,null,0]
[null,{"$f":"\"Meetperiode: \"&TEXT(VLOOKUP(B3,Coordinaten!$A$2:$G$95,7,0),\"dddd dd mmmm jjjj\")","v":"Meetperiode: dinsdag 23 november 2021"}]
[null,"Methodiek: Parkeerdrukmeting met waarnemers"]
[null,"In opdracht van: Vlaamse overheid"]
[null,"Uitgevoerd door: Dufec"]
[null,null,null,"VERDELING NAAR CATEGORIE"]
[null,"Locatie"]
[null,{"$f":"IF(B4=\"\",\"\",HYPERLINK(\"http://www.googlemaps.com/?q=\"&B4,\"Lat/Long: \"&B4))","v":"Lat/Long: 50.913372, 4.031872"}]
[]
[null,null,null,null,null,null,null,null,null,null,null,null,null,null,null,"Legenda"]
[null,null,null,null,null,null,null,null,null,null,null,null,null,null,null,null,"Personenwagen"]
[null,null,null,null,null,null,null,null,null,null,null,null,null,null,null,null,"Vracht"]
[null,null,null,null,null,null,null,null,null,null,null,null,null,null,null,null,"Motor"]
[null,null,null,null,null,null,null,null,null,null,null,null,null,null,null,null,"Obstakel / overig"]
[null,null,null,null,null,null,null,null,null,null,null,null,null,null,null,null,"Fout personenwagen"]
[null,null,null,null,null,null,null,null,null,null,null,null,null,null,null,null,"Fout Vracht"]
[]
[]
[]
[]
[]
[]
[]
[]
[]
[]
[]
[null,"Opmerking"]
[null,"Het onderzoek vindt plaats gedurende coronamaatregelen."]
[null,"Dit heeft mogelijk een effect op de resultaten."]
[]
[null,"Toelichting"]
[null,"Pers = personenwagens op daarvoor bestemde"]
[null,"          openbare plaatsen"]
[null,"Vracht = vrachtwagens op daarvoor bestemde"]
[null,"          parkeerplaatsen (middel- en zwaar vrachtverkeer)"]
[null,"Motor = geparkeerde motoren op openbare plaatsen"]
[null,"Obstakel / overig = obstakels of overige voertuigen"]
[null,"          geparkeerd op openbare plaatsen"]
[null,"Fout pers = personenwagens die fout geparkeerd staan"]
[null,"Fout vracht = vrachtwagens die fout geparkeerd staan"]
[null,"E-wagen = geparkeerde elektrisch voertuig bij een"]
[null,"          elektrisch oplaadpunt"]
[null,"Invalide = personenwagens en motoren op voor"]
[null,"          invalide personen bestemde parkeerplaats"]
[null,"Gestalde fietsen = alle gestalde fietsen op de"]
[null,"          daarvoor bestemde parkeerplaatsen"]

{"sheet":"26.Waasmunster","index":25,"n_rows":57,"n_cols":26,"rows_kept":57,"cut":false,"hidden":false,"merged":[[4,3,5,12],[4,16,5,16],[15,3,16,12]]}
[]
[null,"PARKEERONDERZOEK",null,"CARPOOLPARKINGS EN P+R PARKINGS"]
[null,26,null,{"$f":"B8 & \" - \"& TEXT(VLOOKUP(B3,Coordinaten!$A$2:$G$95,7,0),\"dddd dd mmmm jjjj\")","v":"P+R parking Waasmunster, Waasmunster - dinsdag 09 november 2021"}]
[null,{"$f":"VLOOKUP(B3,Coordinaten!$A$2:$G$95,6,0)","v":"51.127953, 4.079340"}]
[null,null,null,"BEZETTING  ",null,null,null,null,null,null,null,null,null,null,null,null,"OPMERKINGEN"]
[]
[null,"Onderzoeksgebied",null,"Datum","Geregistreerd tussen","Pers","Vracht","Motor","Obstakel / overig","Fout   pers","Fout Vracht","Totaal","E-wagen\nplaats","Invalidenplaats","Gestalde fietsen",null,null,null,null,null,{"$f":"F7","v":"Pers"},"Vracht","Motor","Obstakel / overig","Fout   pers","Fout Vracht"]
[null,{"$f":"VLOOKUP(B3,Coordinaten!$A$2:$G$95,3,0)&\", \"&VLOOKUP(B3,Coordinaten!$A$2:$G$95,5,0)","v":"P+R parking Waasmunster, Waasmunster"},null,"2021-11-09","09:00 - 16:00u",31,0,0,0,0,0,31,0,0,0,null,0,null,{"$f":"D8","v":"2021-11-09"},{"$f":"E8","v":"09:00 - 16:00u"},{"$f":"IF(F8=0,NA(),F8/$L8)","v":1},{"$f":"IF(G8=0,NA(),G8/$L8)","v":{"$error":"#N/A"}},{"$f":"IF(H8=0,NA(),H8/$L8)","v":{"$error":"#N/A"}},{"$error":"#N/A"},{"$error":"#N/A"},{"$error":"#N/A"}]
[null,{"$f":"\"Nabij kruispunt: \"&VLOOKUP(B3,Coordinaten!$A$2:$L$95,4,0)","v":"Nabij kruispunt: N446 / A14"},null,null,null,1,"-","-","-","-","-",1,null,null,null,null,0,null,{"$f":"D10","v":"2021-11-09"},{"$f":"E10","v":"19:00 - 02:00u"},{"$f":"IF(F10=0,NA(),F10/$L10)","v":1},{"$f":"IF(G10=0,NA(),G10/$L10)","v":{"$error":"#N/A"}},{"$error":"#N/A"},{"$error":"#N/A"},{"$error":"#N/A"},{"$error":"#N/A"}]
[null,null,null,"2021-11-09","19:00 - 02:00u",17,0,0,0,0,0,17,0,0,1,null,0]
[null,"Meting",null,null,null,1,"-","-","-","-","-",1,null,null,null,null,0]
[null,{"$f":"\"Meetperiode: \"&TEXT(VLOOKUP(B3,Coordinaten!$A$2:$G$95,7,0),\"dddd dd mmmm jjjj\")","v":"Meetperiode: dinsdag 09 november 2021"}]
[null,"Methodiek: Parkeerdrukmeting met waarnemers"]
[null,"In opdracht van: Vlaamse overheid"]
[null,"Uitgevoerd door: Dufec"]
[null,null,null,"VERDELING NAAR CATEGORIE"]
[null,"Locatie"]
[null,{"$f":"IF(B4=\"\",\"\",HYPERLINK(\"http://www.googlemaps.com/?q=\"&B4,\"Lat/Long: \"&B4))","v":"Lat/Long: 51.127953, 4.079340"}]
[]
[null,null,null,null,null,null,null,null,null,null,null,null,null,null,null,"Legenda"]
[null,null,null,null,null,null,null,null,null,null,null,null,null,null,null,null,"Personenwagen"]
[null,null,null,null,null,null,null,null,null,null,null,null,null,null,null,null,"Vracht"]
[null,null,null,null,null,null,null,null,null,null,null,null,null,null,null,null,"Motor"]
[null,null,null,null,null,null,null,null,null,null,null,null,null,null,null,null,"Obstakel / overig"]
[null,null,null,null,null,null,null,null,null,null,null,null,null,null,null,null,"Fout personenwagen"]
[null,null,null,null,null,null,null,null,null,null,null,null,null,null,null,null,"Fout Vracht"]
[]
[]
[]
[]
[]
[]
[]
[]
[]
[]
[]
[null,"Opmerking"]
[null,"Het onderzoek vindt plaats gedurende coronamaatregelen."]
[null,"Dit heeft mogelijk een effect op de resultaten."]
[]
[null,"Toelichting"]
[null,"Pers = personenwagens op daarvoor bestemde"]
[null,"          openbare plaatsen"]
[null,"Vracht = vrachtwagens op daarvoor bestemde"]
[null,"          parkeerplaatsen (middel- en zwaar vrachtverkeer)"]
[null,"Motor = geparkeerde motoren op openbare plaatsen"]
[null,"Obstakel / overig = obstakels of overige voertuigen"]
[null,"          geparkeerd op openbare plaatsen"]
[null,"Fout pers = personenwagens die fout geparkeerd staan"]
[null,"Fout vracht = vrachtwagens die fout geparkeerd staan"]
[null,"E-wagen = geparkeerde elektrisch voertuig bij een"]
[null,"          elektrisch oplaadpunt"]
[null,"Invalide = personenwagens en motoren op voor"]
[null,"          invalide personen bestemde parkeerplaats"]
[null,"Gestalde fietsen = alle gestalde fietsen op de"]
[null,"          daarvoor bestemde parkeerplaatsen"]

{"sheet":"27.Melsele-Zuid","index":26,"n_rows":57,"n_cols":26,"rows_kept":57,"cut":false,"hidden":false,"merged":[[4,3,5,12],[4,16,5,16],[15,3,16,12]]}
[]
[null,"PARKEERONDERZOEK",null,"CARPOOLPARKINGS EN P+R PARKINGS"]
[null,27,null,{"$f":"B8 & \" - \"& TEXT(VLOOKUP(B3,Coordinaten!$A$2:$G$95,7,0),\"dddd dd mmmm jjjj\")","v":"Carpool parking Melsele-Zuid, Beveren - dinsdag 09 november 2021"}]
[null,{"$f":"VLOOKUP(B3,Coordinaten!$A$2:$G$95,6,0)","v":"51.239507, 4.269469"}]
[null,null,null,"BEZETTING  ",null,null,null,null,null,null,null,null,null,null,null,null,"OPMERKINGEN"]
[]
[null,"Onderzoeksgebied",null,"Datum","Geregistreerd tussen","Pers","Vracht","Motor","Obstakel / overig","Fout   pers","Fout Vracht","Totaal","E-wagen\nplaats","Invalidenplaats","Gestalde fietsen",null,null,null,null,null,{"$f":"F7","v":"Pers"},"Vracht","Motor","Obstakel / overig","Fout   pers","Fout Vracht"]
[null,{"$f":"VLOOKUP(B3,Coordinaten!$A$2:$G$95,3,0)&\", \"&VLOOKUP(B3,Coordinaten!$A$2:$G$95,5,0)","v":"Carpool parking Melsele-Zuid, Beveren"},null,"2021-11-09","09:00 - 16:00u",15,0,0,0,0,1,16,0,0,3,null,0,null,{"$f":"D8","v":"2021-11-09"},{"$f":"E8","v":"09:00 - 16:00u"},{"$f":"IF(F8=0,NA(),F8/$L8)","v":0.9375},{"$f":"IF(G8=0,NA(),G8/$L8)","v":{"$error":"#N/A"}},{"$f":"IF(H8=0,NA(),H8/$L8)","v":{"$error":"#N/A"}},{"$error":"#N/A"},{"$error":"#N/A"},6.25E-2]
[null,{"$f":"\"Nabij kruispunt: \"&VLOOKUP(B3,Coordinaten!$A$2:$L$95,4,0)","v":"Nabij kruispunt: N450 / A11"},null,null,null,0.9375,"-","-","-","-",6.25E-2,1,null,null,null,null,0,null,{"$f":"D10","v":"2021-11-09"},{"$f":"E10","v":"19:00 - 02:00u"},{"$f":"IF(F10=0,NA(),F10/$L10)","v":0.6},{"$f":"IF(G10=0,NA(),G10/$L10)","v":{"$error":"#N/A"}},{"$error":"#N/A"},{"$error":"#N/A"},0.2,0.2]
[null,null,null,"2021-11-09","19:00 - 02:00u",3,0,0,0,1,1,5,0,0,0,null,0]
[null,"Meting",null,null,null,0.6,"-","-","-",0.2,0.2,1,null,null,null,null,0]
[null,{"$f":"\"Meetperiode: \"&TEXT(VLOOKUP(B3,Coordinaten!$A$2:$G$95,7,0),\"dddd dd mmmm jjjj\")","v":"Meetperiode: dinsdag 09 november 2021"}]
[null,"Methodiek: Parkeerdrukmeting met waarnemers"]
[null,"In opdracht van: Vlaamse overheid"]
[null,"Uitgevoerd door: Dufec"]
[null,null,null,"VERDELING NAAR CATEGORIE"]
[null,"Locatie"]
[null,{"$f":"IF(B4=\"\",\"\",HYPERLINK(\"http://www.googlemaps.com/?q=\"&B4,\"Lat/Long: \"&B4))","v":"Lat/Long: 51.239507, 4.269469"}]
[]
[null,null,null,null,null,null,null,null,null,null,null,null,null,null,null,"Legenda"]
[null,null,null,null,null,null,null,null,null,null,null,null,null,null,null,null,"Personenwagen"]
[null,null,null,null,null,null,null,null,null,null,null,null,null,null,null,null,"Vracht"]
[null,null,null,null,null,null,null,null,null,null,null,null,null,null,null,null,"Motor"]
[null,null,null,null,null,null,null,null,null,null,null,null,null,null,null,null,"Obstakel / overig"]
[null,null,null,null,null,null,null,null,null,null,null,null,null,null,null,null,"Fout personenwagen"]
[null,null,null,null,null,null,null,null,null,null,null,null,null,null,null,null,"Fout Vracht"]
[]
[]
[]
[]
[]
[]
[]
[]
[]
[]
[]
[null,"Opmerking"]
[null,"Het onderzoek vindt plaats gedurende coronamaatregelen."]
[null,"Dit heeft mogelijk een effect op de resultaten."]
[]
[null,"Toelichting"]
[null,"Pers = personenwagens op daarvoor bestemde"]
[null,"          openbare plaatsen"]
[null,"Vracht = vrachtwagens op daarvoor bestemde"]
[null,"          parkeerplaatsen (middel- en zwaar vrachtverkeer)"]
[null,"Motor = geparkeerde motoren op openbare plaatsen"]
[null,"Obstakel / overig = obstakels of overige voertuigen"]
[null,"          geparkeerd op openbare plaatsen"]
[null,"Fout pers = personenwagens die fout geparkeerd staan"]
[null,"Fout vracht = vrachtwagens die fout geparkeerd staan"]
[null,"E-wagen = geparkeerde elektrisch voertuig bij een"]
[null,"          elektrisch oplaadpunt"]
[null,"Invalide = personenwagens en motoren op voor"]
[null,"          invalide personen bestemde parkeerplaats"]
[null,"Gestalde fietsen = alle gestalde fietsen op de"]
[null,"          daarvoor bestemde parkeerplaatsen"]

{"sheet":"28.Meerbeke","index":27,"n_rows":57,"n_cols":26,"rows_kept":57,"cut":false,"hidden":false,"merged":[[4,3,5,12],[4,16,5,16],[15,3,16,12]]}
[]
[null,"PARKEERONDERZOEK",null,"CARPOOLPARKINGS EN P+R PARKINGS"]
[null,28,null,{"$f":"B8 & \" - \"& TEXT(VLOOKUP(B3,Coordinaten!$A$2:$G$95,7,0),\"dddd dd mmmm jjjj\")","v":"Carpool parking Meerbeke, Ninove - dinsdag 23 november 2021"}]
[null,{"$f":"VLOOKUP(B3,Coordinaten!$A$2:$G$95,6,0)","v":"50.828223, 4.034914"}]
[null,null,null,"BEZETTING  ",null,null,null,null,null,null,null,null,null,null,null,null,"OPMERKINGEN"]
[]
[null,"Onderzoeksgebied",null,"Datum","Geregistreerd tussen","Pers","Vracht","Motor","Obstakel / overig","Fout   pers","Fout Vracht","Totaal","E-wagen\nplaats","Invalidenplaats","Gestalde fietsen",null,null,null,null,null,{"$f":"F7","v":"Pers"},"Vracht","Motor","Obstakel / overig","Fout   pers","Fout Vracht"]
[null,{"$f":"VLOOKUP(B3,Coordinaten!$A$2:$G$95,3,0)&\", \"&VLOOKUP(B3,Coordinaten!$A$2:$G$95,5,0)","v":"Carpool parking Meerbeke, Ninove"},null,"2021-11-23","09:00 - 16:00u",27,0,0,0,0,0,27,0,0,0,null,"Vanaf 20 november nieuwe coronamaatregelen, waaronder verplicht telewerk",null,{"$f":"D8","v":"2021-11-23"},{"$f":"E8","v":"09:00 - 16:00u"},{"$f":"IF(F8=0,NA(),F8/$L8)","v":1},{"$f":"IF(G8=0,NA(),G8/$L8)","v":{"$error":"#N/A"}},{"$f":"IF(H8=0,NA(),H8/$L8)","v":{"$error":"#N/A"}},{"$error":"#N/A"},{"$error":"#N/A"},{"$error":"#N/A"}]
[null,{"$f":"\"Nabij kruispunt: \"&VLOOKUP(B3,Coordinaten!$A$2:$L$95,4,0)","v":"Nabij kruispunt: N28 / N8"},null,null,null,1,"-","-","-","-","-",1,null,null,null,null,0,null,{"$f":"D10","v":"2021-11-23"},{"$f":"E10","v":"19:00 - 02:00u"},{"$f":"IF(F10=0,NA(),F10/$L10)","v":1},{"$f":"IF(G10=0,NA(),G10/$L10)","v":{"$error":"#N/A"}},{"$error":"#N/A"},{"$error":"#N/A"},{"$error":"#N/A"},{"$error":"#N/A"}]
[null,null,null,"2021-11-23","19:00 - 02:00u",15,0,0,0,0,0,15,0,0,0,null,"Vanaf 20 november nieuwe coronamaatregelen, waaronder verplicht telewerk"]
[null,"Meting",null,null,null,1,"-","-","-","-","-",1,null,null,null,null,0]
[null,{"$f":"\"Meetperiode: \"&TEXT(VLOOKUP(B3,Coordinaten!$A$2:$G$95,7,0),\"dddd dd mmmm jjjj\")","v":"Meetperiode: dinsdag 23 november 2021"}]
[null,"Methodiek: Parkeerdrukmeting met waarnemers"]
[null,"In opdracht van: Vlaamse overheid"]
[null,"Uitgevoerd door: Dufec"]
[null,null,null,"VERDELING NAAR CATEGORIE"]
[null,"Locatie"]
[null,{"$f":"IF(B4=\"\",\"\",HYPERLINK(\"http://www.googlemaps.com/?q=\"&B4,\"Lat/Long: \"&B4))","v":"Lat/Long: 50.828223, 4.034914"}]
[]
[null,null,null,null,null,null,null,null,null,null,null,null,null,null,null,"Legenda"]
[null,null,null,null,null,null,null,null,null,null,null,null,null,null,null,null,"Personenwagen"]
[null,null,null,null,null,null,null,null,null,null,null,null,null,null,null,null,"Vracht"]
[null,null,null,null,null,null,null,null,null,null,null,null,null,null,null,null,"Motor"]
[null,null,null,null,null,null,null,null,null,null,null,null,null,null,null,null,"Obstakel / overig"]
[null,null,null,null,null,null,null,null,null,null,null,null,null,null,null,null,"Fout personenwagen"]
[null,null,null,null,null,null,null,null,null,null,null,null,null,null,null,null,"Fout Vracht"]
[]
[]
[]
[]
[]
[]
[]
[]
[]
[]
[]
[null,"Opmerking"]
[null,"Het onderzoek vindt plaats gedurende coronamaatregelen."]
[null,"Dit heeft mogelijk een effect op de resultaten."]
[]
[null,"Toelichting"]
[null,"Pers = personenwagens op daarvoor bestemde"]
[null,"          openbare plaatsen"]
[null,"Vracht = vrachtwagens op daarvoor bestemde"]
[null,"          parkeerplaatsen (middel- en zwaar vrachtverkeer)"]
[null,"Motor = geparkeerde motoren op openbare plaatsen"]
[null,"Obstakel / overig = obstakels of overige voertuigen"]
[null,"          geparkeerd op openbare plaatsen"]
[null,"Fout pers = personenwagens die fout geparkeerd staan"]
[null,"Fout vracht = vrachtwagens die fout geparkeerd staan"]
[null,"E-wagen = geparkeerde elektrisch voertuig bij een"]
[null,"          elektrisch oplaadpunt"]
[null,"Invalide = personenwagens en motoren op voor"]
[null,"          invalide personen bestemde parkeerplaats"]
[null,"Gestalde fietsen = alle gestalde fietsen op de"]
[null,"          daarvoor bestemde parkeerplaatsen"]

{"sheet":"29.Ninove","index":28,"n_rows":57,"n_cols":26,"rows_kept":57,"cut":false,"hidden":false,"merged":[[4,3,5,12],[4,16,5,16],[15,3,16,12]]}
[]
[null,"PARKEERONDERZOEK",null,"CARPOOLPARKINGS EN P+R PARKINGS"]
[null,29,null,{"$f":"B8 & \" - \"& TEXT(VLOOKUP(B3,Coordinaten!$A$2:$G$95,7,0),\"dddd dd mmmm jjjj\")","v":"Carpool parking Ninove, Ninove - dinsdag 23 november 2021"}]
[null,{"$f":"VLOOKUP(B3,Coordinaten!$A$2:$G$95,6,0)","v":"50.827345, 4.025918"}]
[null,null,null,"BEZETTING  ",null,null,null,null,null,null,null,null,null,null,null,null,"OPMERKINGEN"]
[]
[null,"Onderzoeksgebied",null,"Datum","Geregistreerd tussen","Pers","Vracht","Motor","Obstakel / overig","Fout   pers","Fout Vracht","Totaal","E-wagen\nplaats","Invalidenplaats","Gestalde fietsen",null,null,null,null,null,{"$f":"F7","v":"Pers"},"Vracht","Motor","Obstakel / overig","Fout   pers","Fout Vracht"]
[null,{"$f":"VLOOKUP(B3,Coordinaten!$A$2:$G$95,3,0)&\", \"&VLOOKUP(B3,Coordinaten!$A$2:$G$95,5,0)","v":"Carpool parking Ninove, Ninove"},null,"2021-11-23","09:00 - 16:00u",22,0,0,0,0,0,22,0,0,0,null,"Vanaf 20 november nieuwe coronamaatregelen, waaronder verplicht telewerk",null,{"$f":"D8","v":"2021-11-23"},{"$f":"E8","v":"09:00 - 16:00u"},{"$f":"IF(F8=0,NA(),F8/$L8)","v":1},{"$f":"IF(G8=0,NA(),G8/$L8)","v":{"$error":"#N/A"}},{"$f":"IF(H8=0,NA(),H8/$L8)","v":{"$error":"#N/A"}},{"$error":"#N/A"},{"$error":"#N/A"},{"$error":"#N/A"}]
[null,{"$f":"\"Nabij kruispunt: \"&VLOOKUP(B3,Coordinaten!$A$2:$L$95,4,0)","v":"Nabij kruispunt: N255 / N8"},null,null,null,1,"-","-","-","-","-",1,null,null,null,null,0,null,{"$f":"D10","v":"2021-11-23"},{"$f":"E10","v":"19:00 - 02:00u"},{"$f":"IF(F10=0,NA(),F10/$L10)","v":1},{"$f":"IF(G10=0,NA(),G10/$L10)","v":{"$error":"#N/A"}},{"$error":"#N/A"},{"$error":"#N/A"},{"$error":"#N/A"},{"$error":"#N/A"}]
[null,null,null,"2021-11-23","19:00 - 02:00u",18,0,0,0,0,0,18,0,0,0,null,"Vanaf 20 november nieuwe coronamaatregelen, waaronder verplicht telewerk"]
[null,"Meting",null,null,null,1,"-","-","-","-","-",1,null,null,null,null,0]
[null,{"$f":"\"Meetperiode: \"&TEXT(VLOOKUP(B3,Coordinaten!$A$2:$G$95,7,0),\"dddd dd mmmm jjjj\")","v":"Meetperiode: dinsdag 23 november 2021"}]
[null,"Methodiek: Parkeerdrukmeting met waarnemers"]
[null,"In opdracht van: Vlaamse overheid"]
[null,"Uitgevoerd door: Dufec"]
[null,null,null,"VERDELING NAAR CATEGORIE"]
[null,"Locatie"]
[null,{"$f":"IF(B4=\"\",\"\",HYPERLINK(\"http://www.googlemaps.com/?q=\"&B4,\"Lat/Long: \"&B4))","v":"Lat/Long: 50.827345, 4.025918"}]
[]
[null,null,null,null,null,null,null,null,null,null,null,null,null,null,null,"Legenda"]
[null,null,null,null,null,null,null,null,null,null,null,null,null,null,null,null,"Personenwagen"]
[null,null,null,null,null,null,null,null,null,null,null,null,null,null,null,null,"Vracht"]
[null,null,null,null,null,null,null,null,null,null,null,null,null,null,null,null,"Motor"]
[null,null,null,null,null,null,null,null,null,null,null,null,null,null,null,null,"Obstakel / overig"]
[null,null,null,null,null,null,null,null,null,null,null,null,null,null,null,null,"Fout personenwagen"]
[null,null,null,null,null,null,null,null,null,null,null,null,null,null,null,null,"Fout Vracht"]
[]
[]
[]
[]
[]
[]
[]
[]
[]
[]
[]
[null,"Opmerking"]
[null,"Het onderzoek vindt plaats gedurende coronamaatregelen."]
[null,"Dit heeft mogelijk een effect op de resultaten."]
[]
[null,"Toelichting"]
[null,"Pers = personenwagens op daarvoor bestemde"]
[null,"          openbare plaatsen"]
[null,"Vracht = vrachtwagens op daarvoor bestemde"]
[null,"          parkeerplaatsen (middel- en zwaar vrachtverkeer)"]
[null,"Motor = geparkeerde motoren op openbare plaatsen"]
[null,"Obstakel / overig = obstakels of overige voertuigen"]
[null,"          geparkeerd op openbare plaatsen"]
[null,"Fout pers = personenwagens die fout geparkeerd staan"]
[null,"Fout vracht = vrachtwagens die fout geparkeerd staan"]
[null,"E-wagen = geparkeerde elektrisch voertuig bij een"]
[null,"          elektrisch oplaadpunt"]
[null,"Invalide = personenwagens en motoren op voor"]
[null,"          invalide personen bestemde parkeerplaats"]
[null,"Gestalde fietsen = alle gestalde fietsen op de"]
[null,"          daarvoor bestemde parkeerplaatsen"]

{"sheet":"30.Kruishoutem","index":29,"n_rows":57,"n_cols":26,"rows_kept":57,"cut":false,"hidden":false,"merged":[[4,3,5,12],[4,16,5,16],[15,3,16,12]]}
[]
[null,"PARKEERONDERZOEK",null,"CARPOOLPARKINGS EN P+R PARKINGS"]
[null,30,null,{"$f":"B8 & \" - \"& TEXT(VLOOKUP(B3,Coordinaten!$A$2:$G$95,7,0),\"dddd dd mmmm jjjj\")","v":"Carpool parking Kruishoutem, Kruishoutem - dinsdag 23 november 2021"}]
[null,{"$f":"VLOOKUP(B3,Coordinaten!$A$2:$G$95,6,0)","v":"50.916012, 3.492023"}]
[null,null,null,"BEZETTING  ",null,null,null,null,null,null,null,null,null,null,null,null,"OPMERKINGEN"]
[]
[null,"Onderzoeksgebied",null,"Datum","Geregistreerd tussen","Pers","Vracht","Motor","Obstakel / overig","Fout   pers","Fout Vracht","Totaal","E-wagen\nplaats","Invalidenplaats","Gestalde fietsen",null,null,null,null,null,{"$f":"F7","v":"Pers"},"Vracht","Motor","Obstakel / overig","Fout   pers","Fout Vracht"]
[null,{"$f":"VLOOKUP(B3,Coordinaten!$A$2:$G$95,3,0)&\", \"&VLOOKUP(B3,Coordinaten!$A$2:$G$95,5,0)","v":"Carpool parking Kruishoutem, Kruishoutem"},null,"2021-11-23","09:00 - 16:00u",28,0,0,0,0,0,28,0,0,3,null,"Vanaf 20 november nieuwe coronamaatregelen, waaronder verplicht telewerk",null,{"$f":"D8","v":"2021-11-23"},{"$f":"E8","v":"09:00 - 16:00u"},{"$f":"IF(F8=0,NA(),F8/$L8)","v":1},{"$f":"IF(G8=0,NA(),G8/$L8)","v":{"$error":"#N/A"}},{"$f":"IF(H8=0,NA(),H8/$L8)","v":{"$error":"#N/A"}},{"$error":"#N/A"},{"$error":"#N/A"},{"$error":"#N/A"}]
[null,{"$f":"\"Nabij kruispunt: \"&VLOOKUP(B3,Coordinaten!$A$2:$L$95,4,0)","v":"Nabij kruispunt: N459 / A14"},null,null,null,1,"-","-","-","-","-",1,null,null,null,null,0,null,{"$f":"D10","v":"2021-11-23"},{"$f":"E10","v":"19:00 - 02:00u"},{"$f":"IF(F10=0,NA(),F10/$L10)","v":0.75},{"$f":"IF(G10=0,NA(),G10/$L10)","v":{"$error":"#N/A"}},{"$error":"#N/A"},{"$error":"#N/A"},{"$error":"#N/A"},0.25]
[null,null,null,"2021-11-23","19:00 - 02:00u",12,0,0,0,0,4,16,0,0,0,null,"Vanaf 20 november nieuwe coronamaatregelen, waaronder verplicht telewerk"]
[null,"Meting",null,null,null,0.75,"-","-","-","-",0.25,1,null,null,null,null,0]
[null,{"$f":"\"Meetperiode: \"&TEXT(VLOOKUP(B3,Coordinaten!$A$2:$G$95,7,0),\"dddd dd mmmm jjjj\")","v":"Meetperiode: dinsdag 23 november 2021"}]
[null,"Methodiek: Parkeerdrukmeting met waarnemers"]
[null,"In opdracht van: Vlaamse overheid"]
[null,"Uitgevoerd door: Dufec"]
[null,null,null,"VERDELING NAAR CATEGORIE"]
[null,"Locatie"]
[null,{"$f":"IF(B4=\"\",\"\",HYPERLINK(\"http://www.googlemaps.com/?q=\"&B4,\"Lat/Long: \"&B4))","v":"Lat/Long: 50.916012, 3.492023"}]
[]
[null,null,null,null,null,null,null,null,null,null,null,null,null,null,null,"Legenda"]
[null,null,null,null,null,null,null,null,null,null,null,null,null,null,null,null,"Personenwagen"]
[null,null,null,null,null,null,null,null,null,null,null,null,null,null,null,null,"Vracht"]
[null,null,null,null,null,null,null,null,null,null,null,null,null,null,null,null,"Motor"]
[null,null,null,null,null,null,null,null,null,null,null,null,null,null,null,null,"Obstakel / overig"]
[null,null,null,null,null,null,null,null,null,null,null,null,null,null,null,null,"Fout personenwagen"]
[null,null,null,null,null,null,null,null,null,null,null,null,null,null,null,null,"Fout Vracht"]
[]
[]
[]
[]
[]
[]
[]
[]
[]
[]
[]
[null,"Opmerking"]
[null,"Het onderzoek vindt plaats gedurende coronamaatregelen."]
[null,"Dit heeft mogelijk een effect op de resultaten."]
[]
[null,"Toelichting"]
[null,"Pers = personenwagens op daarvoor bestemde"]
[null,"          openbare plaatsen"]
[null,"Vracht = vrachtwagens op daarvoor bestemde"]
[null,"          parkeerplaatsen (middel- en zwaar vrachtverkeer)"]
[null,"Motor = geparkeerde motoren op openbare plaatsen"]
[null,"Obstakel / overig = obstakels of overige voertuigen"]
[null,"          geparkeerd op openbare plaatsen"]
[null,"Fout pers = personenwagens die fout geparkeerd staan"]
[null,"Fout vracht = vrachtwagens die fout geparkeerd staan"]
[null,"E-wagen = geparkeerde elektrisch voertuig bij een"]
[null,"          elektrisch oplaadpunt"]
[null,"Invalide = personenwagens en motoren op voor"]
[null,"          invalide personen bestemde parkeerplaats"]
[null,"Gestalde fietsen = alle gestalde fietsen op de"]
[null,"          daarvoor bestemde parkeerplaatsen"]

{"sheet":"32.Vrasene-Noord","index":30,"n_rows":57,"n_cols":26,"rows_kept":57,"cut":false,"hidden":false,"merged":[[4,3,5,12],[4,16,5,16],[15,3,16,12]]}
[]
[null,"PARKEERONDERZOEK",null,"CARPOOLPARKINGS EN P+R PARKINGS"]
[null,32,null,{"$f":"B8 & \" - \"& TEXT(VLOOKUP(B3,Coordinaten!$A$2:$G$95,7,0),\"dddd dd mmmm jjjj\")","v":"Carpool parking Vrasene-Noord, Beveren - dinsdag 09 november 2021"}]
[null,{"$f":"VLOOKUP(B3,Coordinaten!$A$2:$G$95,6,0)","v":"51.240943, 4.189741"}]
[null,null,null,"BEZETTING  ",null,null,null,null,null,null,null,null,null,null,null,null,"OPMERKINGEN"]
[]
[null,"Onderzoeksgebied",null,"Datum","Geregistreerd tussen","Pers","Vracht","Motor","Obstakel / overig","Fout   pers","Fout Vracht","Totaal","E-wagen\nplaats","Invalidenplaats","Gestalde fietsen",null,null,null,null,null,{"$f":"F7","v":"Pers"},"Vracht","Motor","Obstakel / overig","Fout   pers","Fout Vracht"]
[null,{"$f":"VLOOKUP(B3,Coordinaten!$A$2:$G$95,3,0)&\", \"&VLOOKUP(B3,Coordinaten!$A$2:$G$95,5,0)","v":"Carpool parking Vrasene-Noord, Beveren"},null,"2021-11-09","09:00 - 16:00u",23,2,0,0,0,0,25,0,0,3,null,0,null,{"$f":"D8","v":"2021-11-09"},{"$f":"E8","v":"09:00 - 16:00u"},{"$f":"IF(F8=0,NA(),F8/$L8)","v":0.92},{"$f":"IF(G8=0,NA(),G8/$L8)","v":0.08},{"$f":"IF(H8=0,NA(),H8/$L8)","v":{"$error":"#N/A"}},{"$error":"#N/A"},{"$error":"#N/A"},{"$error":"#N/A"}]
[null,{"$f":"\"Nabij kruispunt: \"&VLOOKUP(B3,Coordinaten!$A$2:$L$95,4,0)","v":"Nabij kruispunt: N451 / A11"},null,null,null,0.92,0.08,"-","-","-","-",1,null,null,null,null,0,null,{"$f":"D10","v":"2021-11-09"},{"$f":"E10","v":"19:00 - 02:00u"},{"$f":"IF(F10=0,NA(),F10/$L10)","v":0.9},{"$f":"IF(G10=0,NA(),G10/$L10)","v":{"$error":"#N/A"}},{"$error":"#N/A"},{"$error":"#N/A"},{"$error":"#N/A"},0.1]
[null,null,null,"2021-11-09","19:00 - 02:00u",9,0,0,0,0,1,10,0,0,0,null,0]
[null,"Meting",null,null,null,0.9,"-","-","-","-",0.1,1,null,null,null,null,0]
[null,{"$f":"\"Meetperiode: \"&TEXT(VLOOKUP(B3,Coordinaten!$A$2:$G$95,7,0),\"dddd dd mmmm jjjj\")","v":"Meetperiode: dinsdag 09 november 2021"}]
[null,"Methodiek: Parkeerdrukmeting met waarnemers"]
[null,"In opdracht van: Vlaamse overheid"]
[null,"Uitgevoerd door: Dufec"]
[null,null,null,"VERDELING NAAR CATEGORIE"]
[null,"Locatie"]
[null,{"$f":"IF(B4=\"\",\"\",HYPERLINK(\"http://www.googlemaps.com/?q=\"&B4,\"Lat/Long: \"&B4))","v":"Lat/Long: 51.240943, 4.189741"}]
[]
[null,null,null,null,null,null,null,null,null,null,null,null,null,null,null,"Legenda"]
[null,null,null,null,null,null,null,null,null,null,null,null,null,null,null,null,"Personenwagen"]
[null,null,null,null,null,null,null,null,null,null,null,null,null,null,null,null,"Vracht"]
[null,null,null,null,null,null,null,null,null,null,null,null,null,null,null,null,"Motor"]
[null,null,null,null,null,null,null,null,null,null,null,null,null,null,null,null,"Obstakel / overig"]
[null,null,null,null,null,null,null,null,null,null,null,null,null,null,null,null,"Fout personenwagen"]
[null,null,null,null,null,null,null,null,null,null,null,null,null,null,null,null,"Fout Vracht"]
[]
[]
[]
[]
[]
[]
[]
[]
[]
[]
[]
[null,"Opmerking"]
[null,"Het onderzoek vindt plaats gedurende coronamaatregelen."]
[null,"Dit heeft mogelijk een effect op de resultaten."]
[]
[null,"Toelichting"]
[null,"Pers = personenwagens op daarvoor bestemde"]
[null,"          openbare plaatsen"]
[null,"Vracht = vrachtwagens op daarvoor bestemde"]
[null,"          parkeerplaatsen (middel- en zwaar vrachtverkeer)"]
[null,"Motor = geparkeerde motoren op openbare plaatsen"]
[null,"Obstakel / overig = obstakels of overige voertuigen"]
[null,"          geparkeerd op openbare plaatsen"]
[null,"Fout pers = personenwagens die fout geparkeerd staan"]
[null,"Fout vracht = vrachtwagens die fout geparkeerd staan"]
[null,"E-wagen = geparkeerde elektrisch voertuig bij een"]
[null,"          elektrisch oplaadpunt"]
[null,"Invalide = personenwagens en motoren op voor"]
[null,"          invalide personen bestemde parkeerplaats"]
[null,"Gestalde fietsen = alle gestalde fietsen op de"]
[null,"          daarvoor bestemde parkeerplaatsen"]

{"sheet":"33.Merelbeke","index":31,"n_rows":57,"n_cols":26,"rows_kept":57,"cut":false,"hidden":false,"merged":[[4,3,5,12],[4,16,5,16],[15,3,16,12]]}
[]
[null,"PARKEERONDERZOEK",null,"CARPOOLPARKINGS EN P+R PARKINGS"]
[null,33,null,{"$f":"B8 & \" - \"& TEXT(VLOOKUP(B3,Coordinaten!$A$2:$G$95,7,0),\"dddd dd mmmm jjjj\")","v":"Carpool parking Merelbeke, Merelbeke - dinsdag 23 november 2021"}]
[null,{"$f":"VLOOKUP(B3,Coordinaten!$A$2:$G$95,6,0)","v":"51.003542, 3.763040"}]
[null,null,null,"BEZETTING  ",null,null,null,null,null,null,null,null,null,null,null,null,"OPMERKINGEN"]
[]
[null,"Onderzoeksgebied",null,"Datum","Geregistreerd tussen","Pers","Vracht","Motor","Obstakel / overig","Fout   pers","Fout Vracht","Totaal","E-wagen\nplaats","Invalidenplaats","Gestalde fietsen",null,null,null,null,null,{"$f":"F7","v":"Pers"},"Vracht","Motor","Obstakel / overig","Fout   pers","Fout Vracht"]
[null,{"$f":"VLOOKUP(B3,Coordinaten!$A$2:$G$95,3,0)&\", \"&VLOOKUP(B3,Coordinaten!$A$2:$G$95,5,0)","v":"Carpool parking Merelbeke, Merelbeke"},null,"2021-11-23","09:00 - 16:00u",45,0,0,1,0,0,46,0,0,3,null,"Vanaf 20 november nieuwe coronamaatregelen, waaronder verplicht telewerk",null,{"$f":"D8","v":"2021-11-23"},{"$f":"E8","v":"09:00 - 16:00u"},{"$f":"IF(F8=0,NA(),F8/$L8)","v":0.97826086956521741},{"$f":"IF(G8=0,NA(),G8/$L8)","v":{"$error":"#N/A"}},{"$f":"IF(H8=0,NA(),H8/$L8)","v":{"$error":"#N/A"}},2.1739130434782608E-2,{"$error":"#N/A"},{"$error":"#N/A"}]
[null,{"$f":"\"Nabij kruispunt: \"&VLOOKUP(B3,Coordinaten!$A$2:$L$95,4,0)","v":"Nabij kruispunt: B403 / R4"},null,null,null,0.97826086956521741,"-","-",2.1739130434782608E-2,"-","-",1,null,null,null,null,"Obstakel: stalen pijpen op parkeerplaats",null,{"$f":"D10","v":"2021-11-23"},{"$f":"E10","v":"19:00 - 02:00u"},{"$f":"IF(F10=0,NA(),F10/$L10)","v":0.93333333333333335},{"$f":"IF(G10=0,NA(),G10/$L10)","v":{"$error":"#N/A"}},{"$error":"#N/A"},6.6666666666666666E-2,{"$error":"#N/A"},{"$error":"#N/A"}]
[null,null,null,"2021-11-23","19:00 - 02:00u",14,0,0,1,0,0,15,0,0,0,null,"Vanaf 20 november nieuwe coronamaatregelen, waaronder verplicht telewerk"]
[null,"Meting",null,null,null,0.93333333333333335,"-","-",6.6666666666666666E-2,"-","-",1,null,null,null,null,"Obstakel: stalen pijpen op parkeerplaats"]
[null,{"$f":"\"Meetperiode: \"&TEXT(VLOOKUP(B3,Coordinaten!$A$2:$G$95,7,0),\"dddd dd mmmm jjjj\")","v":"Meetperiode: dinsdag 23 november 2021"}]
[null,"Methodiek: Parkeerdrukmeting met waarnemers"]
[null,"In opdracht van: Vlaamse overheid"]
[null,"Uitgevoerd door: Dufec"]
[null,null,null,"VERDELING NAAR CATEGORIE"]
[null,"Locatie"]
[null,{"$f":"IF(B4=\"\",\"\",HYPERLINK(\"http://www.googlemaps.com/?q=\"&B4,\"Lat/Long: \"&B4))","v":"Lat/Long: 51.003542, 3.763040"}]
[]
[null,null,null,null,null,null,null,null,null,null,null,null,null,null,null,"Legenda"]
[null,null,null,null,null,null,null,null,null,null,null,null,null,null,null,null,"Personenwagen"]
[null,null,null,null,null,null,null,null,null,null,null,null,null,null,null,null,"Vracht"]
[null,null,null,null,null,null,null,null,null,null,null,null,null,null,null,null,"Motor"]
[null,null,null,null,null,null,null,null,null,null,null,null,null,null,null,null,"Obstakel / overig"]
[null,null,null,null,null,null,null,null,null,null,null,null,null,null,null,null,"Fout personenwagen"]
[null,null,null,null,null,null,null,null,null,null,null,null,null,null,null,null,"Fout Vracht"]
[]
[]
[]
[]
[]
[]
[]
[]
[]
[]
[]
[null,"Opmerking"]
[null,"Het onderzoek vindt plaats gedurende coronamaatregelen."]
[null,"Dit heeft mogelijk een effect op de resultaten."]
[]
[null,"Toelichting"]
[null,"Pers = personenwagens op daarvoor bestemde"]
[null,"          openbare plaatsen"]
[null,"Vracht = vrachtwagens op daarvoor bestemde"]
[null,"          parkeerplaatsen (middel- en zwaar vrachtverkeer)"]
[null,"Motor = geparkeerde motoren op openbare plaatsen"]
[null,"Obstakel / overig = obstakels of overige voertuigen"]
[null,"          geparkeerd op openbare plaatsen"]
[null,"Fout pers = personenwagens die fout geparkeerd staan"]
[null,"Fout vracht = vrachtwagens die fout geparkeerd staan"]
[null,"E-wagen = geparkeerde elektrisch voertuig bij een"]
[null,"          elektrisch oplaadpunt"]
[null,"Invalide = personenwagens en motoren op voor"]
[null,"          invalide personen bestemde parkeerplaats"]
[null,"Gestalde fietsen = alle gestalde fietsen op de"]
[null,"          daarvoor bestemde parkeerplaatsen"]

{"sheet":"34.Vilvoorde","index":32,"n_rows":57,"n_cols":26,"rows_kept":57,"cut":false,"hidden":false,"merged":[[4,3,5,12],[4,16,5,16],[15,3,16,12]]}
[]
[null,"PARKEERONDERZOEK",null,"CARPOOLPARKINGS EN P+R PARKINGS"]
[null,34,null,{"$f":"B8 & \" - \"& TEXT(VLOOKUP(B3,Coordinaten!$A$2:$G$95,7,0),\"dddd dd mmmm jjjj\")","v":"Carpool parking Vilvoorde, Machelen - donderdag 18 november 2021"}]
[null,{"$f":"VLOOKUP(B3,Coordinaten!$A$2:$G$95,6,0)","v":"50.910540, 4.459740"}]
[null,null,null,"BEZETTING  ",null,null,null,null,null,null,null,null,null,null,null,null,"OPMERKINGEN"]
[]
[null,"Onderzoeksgebied",null,"Datum","Geregistreerd tussen","Pers","Vracht","Motor","Obstakel / overig","Fout   pers","Fout Vracht","Totaal","E-wagen\nplaats","Invalidenplaats","Gestalde fietsen",null,null,null,null,null,{"$f":"F7","v":"Pers"},"Vracht","Motor","Obstakel / overig","Fout   pers","Fout Vracht"]
[null,{"$f":"VLOOKUP(B3,Coordinaten!$A$2:$G$95,3,0)&\", \"&VLOOKUP(B3,Coordinaten!$A$2:$G$95,5,0)","v":"Carpool parking Vilvoorde, Machelen"},null,"2021-11-18","09:00 - 16:00u",28,0,0,0,0,2,30,0,0,0,null,0,null,{"$f":"D8","v":"2021-11-18"},{"$f":"E8","v":"09:00 - 16:00u"},{"$f":"IF(F8=0,NA(),F8/$L8)","v":0.93333333333333335},{"$f":"IF(G8=0,NA(),G8/$L8)","v":{"$error":"#N/A"}},{"$f":"IF(H8=0,NA(),H8/$L8)","v":{"$error":"#N/A"}},{"$error":"#N/A"},{"$error":"#N/A"},6.6666666666666666E-2]
[null,{"$f":"\"Nabij kruispunt: \"&VLOOKUP(B3,Coordinaten!$A$2:$L$95,4,0)","v":"Nabij kruispunt: N211 / N21"},null,null,null,0.93333333333333335,"-","-","-","-",6.6666666666666666E-2,1,null,null,null,null,0,null,{"$f":"D10","v":"2021-11-18"},{"$f":"E10","v":"19:00 - 02:00u"},{"$f":"IF(F10=0,NA(),F10/$L10)","v":1},{"$f":"IF(G10=0,NA(),G10/$L10)","v":{"$error":"#N/A"}},{"$error":"#N/A"},{"$error":"#N/A"},{"$error":"#N/A"},{"$error":"#N/A"}]
[null,null,null,"2021-11-18","19:00 - 02:00u",10,0,0,0,0,0,10,0,0,0,null,0]
[null,"Meting",null,null,null,1,"-","-","-","-","-",1,null,null,null,null,0]
[null,{"$f":"\"Meetperiode: \"&TEXT(VLOOKUP(B3,Coordinaten!$A$2:$G$95,7,0),\"dddd dd mmmm jjjj\")","v":"Meetperiode: donderdag 18 november 2021"}]
[null,"Methodiek: Parkeerdrukmeting met waarnemers"]
[null,"In opdracht van: Vlaamse overheid"]
[null,"Uitgevoerd door: Dufec"]
[null,null,null,"VERDELING NAAR CATEGORIE"]
[null,"Locatie"]
[null,{"$f":"IF(B4=\"\",\"\",HYPERLINK(\"http://www.googlemaps.com/?q=\"&B4,\"Lat/Long: \"&B4))","v":"Lat/Long: 50.910540, 4.459740"}]
[]
[null,null,null,null,null,null,null,null,null,null,null,null,null,null,null,"Legenda"]
[null,null,null,null,null,null,null,null,null,null,null,null,null,null,null,null,"Personenwagen"]
[null,null,null,null,null,null,null,null,null,null,null,null,null,null,null,null,"Vracht"]
[null,null,null,null,null,null,null,null,null,null,null,null,null,null,null,null,"Motor"]
[null,null,null,null,null,null,null,null,null,null,null,null,null,null,null,null,"Obstakel / overig"]
[null,null,null,null,null,null,null,null,null,null,null,null,null,null,null,null,"Fout personenwagen"]
[null,null,null,null,null,null,null,null,null,null,null,null,null,null,null,null,"Fout Vracht"]
[]
[]
[]
[]
[]
[]
[]
[]
[]
[]
[]
[null,"Opmerking"]
[null,"Het onderzoek vindt plaats gedurende coronamaatregelen."]
[null,"Dit heeft mogelijk een effect op de resultaten."]
[]
[null,"Toelichting"]
[null,"Pers = personenwagens op daarvoor bestemde"]
[null,"          openbare plaatsen"]
[null,"Vracht = vrachtwagens op daarvoor bestemde"]
[null,"          parkeerplaatsen (middel- en zwaar vrachtverkeer)"]
[null,"Motor = geparkeerde motoren op openbare plaatsen"]
[null,"Obstakel / overig = obstakels of overige voertuigen"]
[null,"          geparkeerd op openbare plaatsen"]
[null,"Fout pers = personenwagens die fout geparkeerd staan"]
[null,"Fout vracht = vrachtwagens die fout geparkeerd staan"]
[null,"E-wagen = geparkeerde elektrisch voertuig bij een"]
[null,"          elektrisch oplaadpunt"]
[null,"Invalide = personenwagens en motoren op voor"]
[null,"          invalide personen bestemde parkeerplaats"]
[null,"Gestalde fietsen = alle gestalde fietsen op de"]
[null,"          daarvoor bestemde parkeerplaatsen"]

{"sheet":"35.Holsbeek","index":33,"n_rows":57,"n_cols":26,"rows_kept":57,"cut":false,"hidden":false,"merged":[[4,3,5,12],[4,16,5,16],[15,3,16,12]]}
[]
[null,"PARKEERONDERZOEK",null,"CARPOOLPARKINGS EN P+R PARKINGS"]
[null,35,null,{"$f":"B8 & \" - \"& TEXT(VLOOKUP(B3,Coordinaten!$A$2:$G$95,7,0),\"dddd dd mmmm jjjj\")","v":"Carpool parking Holsbeek, Leuven - dinsdag 16 november 2021"}]
[null,{"$f":"VLOOKUP(B3,Coordinaten!$A$2:$G$95,6,0)","v":"50.933565, 4.743369"}]
[null,null,null,"BEZETTING  ",null,null,null,null,null,null,null,null,null,null,null,null,"OPMERKINGEN"]
[]
[null,"Onderzoeksgebied",null,"Datum","Geregistreerd tussen","Pers","Vracht","Motor","Obstakel / overig","Fout   pers","Fout Vracht","Totaal","E-wagen\nplaats","Invalidenplaats","Gestalde fietsen",null,null,null,null,null,{"$f":"F7","v":"Pers"},"Vracht","Motor","Obstakel / overig","Fout   pers","Fout Vracht"]
[null,{"$f":"VLOOKUP(B3,Coordinaten!$A$2:$G$95,3,0)&\", \"&VLOOKUP(B3,Coordinaten!$A$2:$G$95,5,0)","v":"Carpool parking Holsbeek, Leuven"},null,"2021-11-16","09:00 - 16:00u",13,0,0,0,0,0,13,0,0,0,null,0,null,{"$f":"D8","v":"2021-11-16"},{"$f":"E8","v":"09:00 - 16:00u"},{"$f":"IF(F8=0,NA(),F8/$L8)","v":1},{"$f":"IF(G8=0,NA(),G8/$L8)","v":{"$error":"#N/A"}},{"$f":"IF(H8=0,NA(),H8/$L8)","v":{"$error":"#N/A"}},{"$error":"#N/A"},{"$error":"#N/A"},{"$error":"#N/A"}]
[null,{"$f":"\"Nabij kruispunt: \"&VLOOKUP(B3,Coordinaten!$A$2:$L$95,4,0)","v":"Nabij kruispunt: N229 / A2"},null,null,null,1,"-","-","-","-","-",1,null,null,null,null,0,null,{"$f":"D10","v":"2021-11-16"},{"$f":"E10","v":"19:00 - 02:00u"},{"$f":"IF(F10=0,NA(),F10/$L10)","v":1},{"$f":"IF(G10=0,NA(),G10/$L10)","v":{"$error":"#N/A"}},{"$error":"#N/A"},{"$error":"#N/A"},{"$error":"#N/A"},{"$error":"#N/A"}]
[null,null,null,"2021-11-16","19:00 - 02:00u",5,0,0,0,0,0,5,0,0,0,null,0]
[null,"Meting",null,null,null,1,"-","-","-","-","-",1,null,null,null,null,0]
[null,{"$f":"\"Meetperiode: \"&TEXT(VLOOKUP(B3,Coordinaten!$A$2:$G$95,7,0),\"dddd dd mmmm jjjj\")","v":"Meetperiode: dinsdag 16 november 2021"}]
[null,"Methodiek: Parkeerdrukmeting met waarnemers"]
[null,"In opdracht van: Vlaamse overheid"]
[null,"Uitgevoerd door: Dufec"]
[null,null,null,"VERDELING NAAR CATEGORIE"]
[null,"Locatie"]
[null,{"$f":"IF(B4=\"\",\"\",HYPERLINK(\"http://www.googlemaps.com/?q=\"&B4,\"Lat/Long: \"&B4))","v":"Lat/Long: 50.933565, 4.743369"}]
[]
[null,null,null,null,null,null,null,null,null,null,null,null,null,null,null,"Legenda"]
[null,null,null,null,null,null,null,null,null,null,null,null,null,null,null,null,"Personenwagen"]
[null,null,null,null,null,null,null,null,null,null,null,null,null,null,null,null,"Vracht"]
[null,null,null,null,null,null,null,null,null,null,null,null,null,null,null,null,"Motor"]
[null,null,null,null,null,null,null,null,null,null,null,null,null,null,null,null,"Obstakel / overig"]
[null,null,null,null,null,null,null,null,null,null,null,null,null,null,null,null,"Fout personenwagen"]
[null,null,null,null,null,null,null,null,null,null,null,null,null,null,null,null,"Fout Vracht"]
[]
[]
[]
[]
[]
[]
[]
[]
[]
[]
[]
[null,"Opmerking"]
[null,"Het onderzoek vindt plaats gedurende coronamaatregelen."]
[null,"Dit heeft mogelijk een effect op de resultaten."]
[]
[null,"Toelichting"]
[null,"Pers = personenwagens op daarvoor bestemde"]
[null,"          openbare plaatsen"]
[null,"Vracht = vrachtwagens op daarvoor bestemde"]
[null,"          parkeerplaatsen (middel- en zwaar vrachtverkeer)"]
[null,"Motor = geparkeerde motoren op openbare plaatsen"]
[null,"Obstakel / overig = obstakels of overige voertuigen"]
[null,"          geparkeerd op openbare plaatsen"]
[null,"Fout pers = personenwagens die fout geparkeerd staan"]
[null,"Fout vracht = vrachtwagens die fout geparkeerd staan"]
[null,"E-wagen = geparkeerde elektrisch voertuig bij een"]
[null,"          elektrisch oplaadpunt"]
[null,"Invalide = personenwagens en motoren op voor"]
[null,"          invalide personen bestemde parkeerplaats"]
[null,"Gestalde fietsen = alle gestalde fietsen op de"]
[null,"          daarvoor bestemde parkeerplaatsen"]

{"sheet":"36.Halle-Essenbeek","index":34,"n_rows":57,"n_cols":26,"rows_kept":57,"cut":false,"hidden":false,"merged":[[4,3,5,12],[4,16,5,16],[15,3,16,12]]}
[]
[null,"PARKEERONDERZOEK",null,"CARPOOLPARKINGS EN P+R PARKINGS"]
[null,36,null,{"$f":"B8 & \" - \"& TEXT(VLOOKUP(B3,Coordinaten!$A$2:$G$95,7,0),\"dddd dd mmmm jjjj\")","v":"P+R parking Halle-Essenbeek, Halle - dinsdag 23 november 2021"}]
[null,{"$f":"VLOOKUP(B3,Coordinaten!$A$2:$G$95,6,0)","v":"50.721091, 4.250252"}]
[null,null,null,"BEZETTING  ",null,null,null,null,null,null,null,null,null,null,null,null,"OPMERKINGEN"]
[]
[null,"Onderzoeksgebied",null,"Datum","Geregistreerd tussen","Pers","Vracht","Motor","Obstakel / overig","Fout   pers","Fout Vracht","Totaal","E-wagen\nplaats","Invalidenplaats","Gestalde fietsen",null,null,null,null,null,{"$f":"F7","v":"Pers"},"Vracht","Motor","Obstakel / overig","Fout   pers","Fout Vracht"]
[null,{"$f":"VLOOKUP(B3,Coordinaten!$A$2:$G$95,3,0)&\", \"&VLOOKUP(B3,Coordinaten!$A$2:$G$95,5,0)","v":"P+R parking Halle-Essenbeek, Halle"},null,"2021-11-23","09:00 - 16:00u",15,0,0,0,0,0,15,0,0,0,null,"Vanaf 20 november nieuwe coronamaatregelen, waaronder verplicht telewerk",null,{"$f":"D8","v":"2021-11-23"},{"$f":"E8","v":"09:00 - 16:00u"},{"$f":"IF(F8=0,NA(),F8/$L8)","v":1},{"$f":"IF(G8=0,NA(),G8/$L8)","v":{"$error":"#N/A"}},{"$f":"IF(H8=0,NA(),H8/$L8)","v":{"$error":"#N/A"}},{"$error":"#N/A"},{"$error":"#N/A"},{"$error":"#N/A"}]
[null,{"$f":"\"Nabij kruispunt: \"&VLOOKUP(B3,Coordinaten!$A$2:$L$95,4,0)","v":"Nabij kruispunt: N28 / N203a"},null,null,null,1,"-","-","-","-","-",1,null,null,null,null,0,null,{"$f":"D10","v":"2021-11-23"},{"$f":"E10","v":"19:00 - 02:00u"},{"$f":"IF(F10=0,NA(),F10/$L10)","v":1},{"$f":"IF(G10=0,NA(),G10/$L10)","v":{"$error":"#N/A"}},{"$error":"#N/A"},{"$error":"#N/A"},{"$error":"#N/A"},{"$error":"#N/A"}]
[null,null,null,"2021-11-23","19:00 - 02:00u",13,0,0,0,0,0,13,0,0,0,null,"Vanaf 20 november nieuwe coronamaatregelen, waaronder verplicht telewerk"]
[null,"Meting",null,null,null,1,"-","-","-","-","-",1,null,null,null,null,0]
[null,{"$f":"\"Meetperiode: \"&TEXT(VLOOKUP(B3,Coordinaten!$A$2:$G$95,7,0),\"dddd dd mmmm jjjj\")","v":"Meetperiode: dinsdag 23 november 2021"}]
[null,"Methodiek: Parkeerdrukmeting met waarnemers"]
[null,"In opdracht van: Vlaamse overheid"]
[null,"Uitgevoerd door: Dufec"]
[null,null,null,"VERDELING NAAR CATEGORIE"]
[null,"Locatie"]
[null,{"$f":"IF(B4=\"\",\"\",HYPERLINK(\"http://www.googlemaps.com/?q=\"&B4,\"Lat/Long: \"&B4))","v":"Lat/Long: 50.721091, 4.250252"}]
[]
[null,null,null,null,null,null,null,null,null,null,null,null,null,null,null,"Legenda"]
[null,null,null,null,null,null,null,null,null,null,null,null,null,null,null,null,"Personenwagen"]
[null,null,null,null,null,null,null,null,null,null,null,null,null,null,null,null,"Vracht"]
[null,null,null,null,null,null,null,null,null,null,null,null,null,null,null,null,"Motor"]
[null,null,null,null,null,null,null,null,null,null,null,null,null,null,null,null,"Obstakel / overig"]
[null,null,null,null,null,null,null,null,null,null,null,null,null,null,null,null,"Fout personenwagen"]
[null,null,null,null,null,null,null,null,null,null,null,null,null,null,null,null,"Fout Vracht"]
[]
[]
[]
[]
[]
[]
[]
[]
[]
[]
[]
[null,"Opmerking"]
[null,"Het onderzoek vindt plaats gedurende coronamaatregelen."]
[null,"Dit heeft mogelijk een effect op de resultaten."]
[]
[null,"Toelichting"]
[null,"Pers = personenwagens op daarvoor bestemde"]
[null,"          openbare plaatsen"]
[null,"Vracht = vrachtwagens op daarvoor bestemde"]
[null,"          parkeerplaatsen (middel- en zwaar vrachtverkeer)"]
[null,"Motor = geparkeerde motoren op openbare plaatsen"]
[null,"Obstakel / overig = obstakels of overige voertuigen"]
[null,"          geparkeerd op openbare plaatsen"]
[null,"Fout pers = personenwagens die fout geparkeerd staan"]
[null,"Fout vracht = vrachtwagens die fout geparkeerd staan"]
[null,"E-wagen = geparkeerde elektrisch voertuig bij een"]
[null,"          elektrisch oplaadpunt"]
[null,"Invalide = personenwagens en motoren op voor"]
[null,"          invalide personen bestemde parkeerplaats"]
[null,"Gestalde fietsen = alle gestalde fietsen op de"]
[null,"          daarvoor bestemde parkeerplaatsen"]

{"sheet":"37.Halle-Sint Rochus","index":35,"n_rows":57,"n_cols":26,"rows_kept":57,"cut":false,"hidden":false,"merged":[[4,3,5,12],[4,16,5,16],[15,3,16,12]]}
[]
[null,"PARKEERONDERZOEK",null,"CARPOOLPARKINGS EN P+R PARKINGS"]
[null,37,null,{"$f":"B8 & \" - \"& TEXT(VLOOKUP(B3,Coordinaten!$A$2:$G$95,7,0),\"dddd dd mmmm jjjj\")","v":"Carpool parking Halle-Sint Rochus, Halle - dinsdag 23 november 2021"}]
[null,{"$f":"VLOOKUP(B3,Coordinaten!$A$2:$G$95,6,0)","v":"50.727008, 4.258883"}]
[null,null,null,"BEZETTING  ",null,null,null,null,null,null,null,null,null,null,null,null,"OPMERKINGEN"]
[]
[null,"Onderzoeksgebied",null,"Datum","Geregistreerd tussen","Pers","Vracht","Motor","Obstakel / overig","Fout   pers","Fout Vracht","Totaal","E-wagen\nplaats","Invalidenplaats","Gestalde fietsen",null,null,null,null,null,{"$f":"F7","v":"Pers"},"Vracht","Motor","Obstakel / overig","Fout   pers","Fout Vracht"]
[null,{"$f":"VLOOKUP(B3,Coordinaten!$A$2:$G$95,3,0)&\", \"&VLOOKUP(B3,Coordinaten!$A$2:$G$95,5,0)","v":"Carpool parking Halle-Sint Rochus, Halle"},null,"2021-11-23","09:00 - 16:00u",6,0,0,0,0,4,10,0,0,0,null,"Vanaf 20 november nieuwe coronamaatregelen, waaronder verplicht telewerk",null,{"$f":"D8","v":"2021-11-23"},{"$f":"E8","v":"09:00 - 16:00u"},{"$f":"IF(F8=0,NA(),F8/$L8)","v":0.6},{"$f":"IF(G8=0,NA(),G8/$L8)","v":{"$error":"#N/A"}},{"$f":"IF(H8=0,NA(),H8/$L8)","v":{"$error":"#N/A"}},{"$error":"#N/A"},{"$error":"#N/A"},0.4]
[null,{"$f":"\"Nabij kruispunt: \"&VLOOKUP(B3,Coordinaten!$A$2:$L$95,4,0)","v":"Nabij kruispunt: N203 / N203a"},null,null,null,0.6,"-","-","-","-",0.4,1,null,null,null,null,0,null,{"$f":"D10","v":"2021-11-23"},{"$f":"E10","v":"19:00 - 02:00u"},{"$f":"IF(F10=0,NA(),F10/$L10)","v":1},{"$f":"IF(G10=0,NA(),G10/$L10)","v":{"$error":"#N/A"}},{"$error":"#N/A"},{"$error":"#N/A"},{"$error":"#N/A"},{"$error":"#N/A"}]
[null,null,null,"2021-11-23","19:00 - 02:00u",5,0,0,0,0,0,5,0,0,0,null,"Vanaf 20 november nieuwe coronamaatregelen, waaronder verplicht telewerk"]
[null,"Meting",null,null,null,1,"-","-","-","-","-",1,null,null,null,null,0]
[null,{"$f":"\"Meetperiode: \"&TEXT(VLOOKUP(B3,Coordinaten!$A$2:$G$95,7,0),\"dddd dd mmmm jjjj\")","v":"Meetperiode: dinsdag 23 november 2021"}]
[null,"Methodiek: Parkeerdrukmeting met waarnemers"]
[null,"In opdracht van: Vlaamse overheid"]
[null,"Uitgevoerd door: Dufec"]
[null,null,null,"VERDELING NAAR CATEGORIE"]
[null,"Locatie"]
[null,{"$f":"IF(B4=\"\",\"\",HYPERLINK(\"http://www.googlemaps.com/?q=\"&B4,\"Lat/Long: \"&B4))","v":"Lat/Long: 50.727008, 4.258883"}]
[]
[null,null,null,null,null,null,null,null,null,null,null,null,null,null,null,"Legenda"]
[null,null,null,null,null,null,null,null,null,null,null,null,null,null,null,null,"Personenwagen"]
[null,null,null,null,null,null,null,null,null,null,null,null,null,null,null,null,"Vracht"]
[null,null,null,null,null,null,null,null,null,null,null,null,null,null,null,null,"Motor"]
[null,null,null,null,null,null,null,null,null,null,null,null,null,null,null,null,"Obstakel / overig"]
[null,null,null,null,null,null,null,null,null,null,null,null,null,null,null,null,"Fout personenwagen"]
[null,null,null,null,null,null,null,null,null,null,null,null,null,null,null,null,"Fout Vracht"]
[]
[]
[]
[]
[]
[]
[]
[]
[]
[]
[]
[null,"Opmerking"]
[null,"Het onderzoek vindt plaats gedurende coronamaatregelen."]
[null,"Dit heeft mogelijk een effect op de resultaten."]
[]
[null,"Toelichting"]
[null,"Pers = personenwagens op daarvoor bestemde"]
[null,"          openbare plaatsen"]
[null,"Vracht = vrachtwagens op daarvoor bestemde"]
[null,"          parkeerplaatsen (middel- en zwaar vrachtverkeer)"]
[null,"Motor = geparkeerde motoren op openbare plaatsen"]
[null,"Obstakel / overig = obstakels of overige voertuigen"]
[null,"          geparkeerd op openbare plaatsen"]
[null,"Fout pers = personenwagens die fout geparkeerd staan"]
[null,"Fout vracht = vrachtwagens die fout geparkeerd staan"]
[null,"E-wagen = geparkeerde elektrisch voertuig bij een"]
[null,"          elektrisch oplaadpunt"]
[null,"Invalide = personenwagens en motoren op voor"]
[null,"          invalide personen bestemde parkeerplaats"]
[null,"Gestalde fietsen = alle gestalde fietsen op de"]
[null,"          daarvoor bestemde parkeerplaatsen"]

{"sheet":"38.Boutersem","index":36,"n_rows":57,"n_cols":26,"rows_kept":57,"cut":false,"hidden":false,"merged":[[4,3,5,12],[4,16,5,16],[15,3,16,12]]}
[]
[null,"PARKEERONDERZOEK",null,"CARPOOLPARKINGS EN P+R PARKINGS"]
[null,38,null,{"$f":"B8 & \" - \"& TEXT(VLOOKUP(B3,Coordinaten!$A$2:$G$95,7,0),\"dddd dd mmmm jjjj\")","v":"Carpool parking Boutersem, Boutersem - dinsdag 16 november 2021"}]
[null,{"$f":"VLOOKUP(B3,Coordinaten!$A$2:$G$95,6,0)","v":"50.825404, 4.814390"}]
[null,null,null,"BEZETTING  ",null,null,null,null,null,null,null,null,null,null,null,null,"OPMERKINGEN"]
[]
[null,"Onderzoeksgebied",null,"Datum","Geregistreerd tussen","Pers","Vracht","Motor","Obstakel / overig","Fout   pers","Fout Vracht","Totaal","E-wagen\nplaats","Invalidenplaats","Gestalde fietsen",null,null,null,null,null,{"$f":"F7","v":"Pers"},"Vracht","Motor","Obstakel / overig","Fout   pers","Fout Vracht"]
[null,{"$f":"VLOOKUP(B3,Coordinaten!$A$2:$G$95,3,0)&\", \"&VLOOKUP(B3,Coordinaten!$A$2:$G$95,5,0)","v":"Carpool parking Boutersem, Boutersem"},null,"2021-11-16","09:00 - 16:00u",22,0,0,0,1,0,23,0,0,0,null,0,null,{"$f":"D8","v":"2021-11-16"},{"$f":"E8","v":"09:00 - 16:00u"},{"$f":"IF(F8=0,NA(),F8/$L8)","v":0.95652173913043481},{"$f":"IF(G8=0,NA(),G8/$L8)","v":{"$error":"#N/A"}},{"$f":"IF(H8=0,NA(),H8/$L8)","v":{"$error":"#N/A"}},{"$error":"#N/A"},4.3478260869565216E-2,{"$error":"#N/A"}]
[null,{"$f":"\"Nabij kruispunt: \"&VLOOKUP(B3,Coordinaten!$A$2:$L$95,4,0)","v":"Nabij kruispunt: N234 / A3"},null,null,null,0.95652173913043481,"-","-","-",4.3478260869565216E-2,"-",1,null,null,null,null,0,null,{"$f":"D10","v":"2021-11-16"},{"$f":"E10","v":"19:00 - 02:00u"},{"$f":"IF(F10=0,NA(),F10/$L10)","v":1},{"$f":"IF(G10=0,NA(),G10/$L10)","v":{"$error":"#N/A"}},{"$error":"#N/A"},{"$error":"#N/A"},{"$error":"#N/A"},{"$error":"#N/A"}]
[null,null,null,"2021-11-16","19:00 - 02:00u",6,0,0,0,0,0,6,0,0,1,null,0]
[null,"Meting",null,null,null,1,"-","-","-","-","-",1,null,null,null,null,0]
[null,{"$f":"\"Meetperiode: \"&TEXT(VLOOKUP(B3,Coordinaten!$A$2:$G$95,7,0),\"dddd dd mmmm jjjj\")","v":"Meetperiode: dinsdag 16 november 2021"}]
[null,"Methodiek: Parkeerdrukmeting met waarnemers"]
[null,"In opdracht van: Vlaamse overheid"]
[null,"Uitgevoerd door: Dufec"]
[null,null,null,"VERDELING NAAR CATEGORIE"]
[null,"Locatie"]
[null,{"$f":"IF(B4=\"\",\"\",HYPERLINK(\"http://www.googlemaps.com/?q=\"&B4,\"Lat/Long: \"&B4))","v":"Lat/Long: 50.825404, 4.814390"}]
[]
[null,null,null,null,null,null,null,null,null,null,null,null,null,null,null,"Legenda"]
[null,null,null,null,null,null,null,null,null,null,null,null,null,null,null,null,"Personenwagen"]
[null,null,null,null,null,null,null,null,null,null,null,null,null,null,null,null,"Vracht"]
[null,null,null,null,null,null,null,null,null,null,null,null,null,null,null,null,"Motor"]
[null,null,null,null,null,null,null,null,null,null,null,null,null,null,null,null,"Obstakel / overig"]
[null,null,null,null,null,null,null,null,null,null,null,null,null,null,null,null,"Fout personenwagen"]
[null,null,null,null,null,null,null,null,null,null,null,null,null,null,null,null,"Fout Vracht"]
[]
[]
[]
[]
[]
[]
[]
[]
[]
[]
[]
[null,"Opmerking"]
[null,"Het onderzoek vindt plaats gedurende coronamaatregelen."]
[null,"Dit heeft mogelijk een effect op de resultaten."]
[]
[null,"Toelichting"]
[null,"Pers = personenwagens op daarvoor bestemde"]
[null,"          openbare plaatsen"]
[null,"Vracht = vrachtwagens op daarvoor bestemde"]
[null,"          parkeerplaatsen (middel- en zwaar vrachtverkeer)"]
[null,"Motor = geparkeerde motoren op openbare plaatsen"]
[null,"Obstakel / overig = obstakels of overige voertuigen"]
[null,"          geparkeerd op openbare plaatsen"]
[null,"Fout pers = personenwagens die fout geparkeerd staan"]
[null,"Fout vracht = vrachtwagens die fout geparkeerd staan"]
[null,"E-wagen = geparkeerde elektrisch voertuig bij een"]
[null,"          elektrisch oplaadpunt"]
[null,"Invalide = personenwagens en motoren op voor"]
[null,"          invalide personen bestemde parkeerplaats"]
[null,"Gestalde fietsen = alle gestalde fietsen op de"]
[null,"          daarvoor bestemde parkeerplaatsen"]

{"sheet":"39.Aarschot","index":37,"n_rows":57,"n_cols":26,"rows_kept":57,"cut":false,"hidden":false,"merged":[[4,3,5,12],[4,16,5,16],[15,3,16,12]]}
[]
[null,"PARKEERONDERZOEK",null,"CARPOOLPARKINGS EN P+R PARKINGS"]
[null,39,null,{"$f":"B8 & \" - \"& TEXT(VLOOKUP(B3,Coordinaten!$A$2:$G$95,7,0),\"dddd dd mmmm jjjj\")","v":"Carpool parking Aarschot, Aarschot - dinsdag 16 november 2021"}]
[null,{"$f":"VLOOKUP(B3,Coordinaten!$A$2:$G$95,6,0)","v":"50.963819, 4.836608"}]
[null,null,null,"BEZETTING  ",null,null,null,null,null,null,null,null,null,null,null,null,"OPMERKINGEN"]
[]
[null,"Onderzoeksgebied",null,"Datum","Geregistreerd tussen","Pers","Vracht","Motor","Obstakel / overig","Fout   pers","Fout Vracht","Totaal","E-wagen\nplaats","Invalidenplaats","Gestalde fietsen",null,null,null,null,null,{"$f":"F7","v":"Pers"},"Vracht","Motor","Obstakel / overig","Fout   pers","Fout Vracht"]
[null,{"$f":"VLOOKUP(B3,Coordinaten!$A$2:$G$95,3,0)&\", \"&VLOOKUP(B3,Coordinaten!$A$2:$G$95,5,0)","v":"Carpool parking Aarschot, Aarschot"},null,"2021-11-16","09:00 - 16:00u",44,0,0,1,0,0,45,0,0,0,null,"Obstakel: hoogwerker",null,{"$f":"D8","v":"2021-11-16"},{"$f":"E8","v":"09:00 - 16:00u"},{"$f":"IF(F8=0,NA(),F8/$L8)","v":0.97777777777777775},{"$f":"IF(G8=0,NA(),G8/$L8)","v":{"$error":"#N/A"}},{"$f":"IF(H8=0,NA(),H8/$L8)","v":{"$error":"#N/A"}},2.2222222222222223E-2,{"$error":"#N/A"},{"$error":"#N/A"}]
[null,{"$f":"\"Nabij kruispunt: \"&VLOOKUP(B3,Coordinaten!$A$2:$L$95,4,0)","v":"Nabij kruispunt: A2 / N233"},null,null,null,0.97777777777777775,"-","-",2.2222222222222223E-2,"-","-",1,null,null,null,null,0,null,{"$f":"D10","v":"2021-11-16"},{"$f":"E10","v":"19:00 - 02:00u"},{"$f":"IF(F10=0,NA(),F10/$L10)","v":0.91666666666666663},{"$f":"IF(G10=0,NA(),G10/$L10)","v":{"$error":"#N/A"}},{"$error":"#N/A"},8.3333333333333329E-2,{"$error":"#N/A"},{"$error":"#N/A"}]
[null,null,null,"2021-11-16","19:00 - 02:00u",11,0,0,1,0,0,12,0,0,0,null,"Obstakel: hoogwerker"]
[null,"Meting",null,null,null,0.91666666666666663,"-","-",8.3333333333333329E-2,"-","-",1,null,null,null,null,0]
[null,{"$f":"\"Meetperiode: \"&TEXT(VLOOKUP(B3,Coordinaten!$A$2:$G$95,7,0),\"dddd dd mmmm jjjj\")","v":"Meetperiode: dinsdag 16 november 2021"}]
[null,"Methodiek: Parkeerdrukmeting met waarnemers"]
[null,"In opdracht van: Vlaamse overheid"]
[null,"Uitgevoerd door: Dufec"]
[null,null,null,"VERDELING NAAR CATEGORIE"]
[null,"Locatie"]
[null,{"$f":"IF(B4=\"\",\"\",HYPERLINK(\"http://www.googlemaps.com/?q=\"&B4,\"Lat/Long: \"&B4))","v":"Lat/Long: 50.963819, 4.836608"}]
[]
[null,null,null,null,null,null,null,null,null,null,null,null,null,null,null,"Legenda"]
[null,null,null,null,null,null,null,null,null,null,null,null,null,null,null,null,"Personenwagen"]
[null,null,null,null,null,null,null,null,null,null,null,null,null,null,null,null,"Vracht"]
[null,null,null,null,null,null,null,null,null,null,null,null,null,null,null,null,"Motor"]
[null,null,null,null,null,null,null,null,null,null,null,null,null,null,null,null,"Obstakel / overig"]
[null,null,null,null,null,null,null,null,null,null,null,null,null,null,null,null,"Fout personenwagen"]
[null,null,null,null,null,null,null,null,null,null,null,null,null,null,null,null,"Fout Vracht"]
[]
[]
[]
[]
[]
[]
[]
[]
[]
[]
[]
[null,"Opmerking"]
[null,"Het onderzoek vindt plaats gedurende coronamaatregelen."]
[null,"Dit heeft mogelijk een effect op de resultaten."]
[]
[null,"Toelichting"]
[null,"Pers = personenwagens op daarvoor bestemde"]
[null,"          openbare plaatsen"]
[null,"Vracht = vrachtwagens op daarvoor bestemde"]
[null,"          parkeerplaatsen (middel- en zwaar vrachtverkeer)"]
[null,"Motor = geparkeerde motoren op openbare plaatsen"]
[null,"Obstakel / overig = obstakels of overige voertuigen"]
[null,"          geparkeerd op openbare plaatsen"]
[null,"Fout pers = personenwagens die fout geparkeerd staan"]
[null,"Fout vracht = vrachtwagens die fout geparkeerd staan"]
[null,"E-wagen = geparkeerde elektrisch voertuig bij een"]
[null,"          elektrisch oplaadpunt"]
[null,"Invalide = personenwagens en motoren op voor"]
[null,"          invalide personen bestemde parkeerplaats"]
[null,"Gestalde fietsen = alle gestalde fietsen op de"]
[null,"          daarvoor bestemde parkeerplaatsen"]

{"sheet":"40.Tielt-Winge","index":38,"n_rows":57,"n_cols":26,"rows_kept":57,"cut":false,"hidden":false,"merged":[[4,3,5,12],[4,16,5,16],[15,3,16,12]]}
[]
[null,"PARKEERONDERZOEK",null,"CARPOOLPARKINGS EN P+R PARKINGS"]
[null,40,null,{"$f":"B8 & \" - \"& TEXT(VLOOKUP(B3,Coordinaten!$A$2:$G$95,7,0),\"dddd dd mmmm jjjj\")","v":"Carpool parking Tielt-Winge, Tielt-Winge - dinsdag 16 november 2021"}]
[null,{"$f":"VLOOKUP(B3,Coordinaten!$A$2:$G$95,6,0)","v":"50.959801, 4.930284"}]
[null,null,null,"BEZETTING  ",null,null,null,null,null,null,null,null,null,null,null,null,"OPMERKINGEN"]
[]
[null,"Onderzoeksgebied",null,"Datum","Geregistreerd tussen","Pers","Vracht","Motor","Obstakel / overig","Fout   pers","Fout Vracht","Totaal","E-wagen\nplaats","Invalidenplaats","Gestalde fietsen",null,null,null,null,null,{"$f":"F7","v":"Pers"},"Vracht","Motor","Obstakel / overig","Fout   pers","Fout Vracht"]
[null,{"$f":"VLOOKUP(B3,Coordinaten!$A$2:$G$95,3,0)&\", \"&VLOOKUP(B3,Coordinaten!$A$2:$G$95,5,0)","v":"Carpool parking Tielt-Winge, Tielt-Winge"},null,"2021-11-16","09:00 - 16:00u",23,0,0,0,0,1,24,0,0,1,null,0,null,{"$f":"D8","v":"2021-11-16"},{"$f":"E8","v":"09:00 - 16:00u"},{"$f":"IF(F8=0,NA(),F8/$L8)","v":0.95833333333333337},{"$f":"IF(G8=0,NA(),G8/$L8)","v":{"$error":"#N/A"}},{"$f":"IF(H8=0,NA(),H8/$L8)","v":{"$error":"#N/A"}},{"$error":"#N/A"},{"$error":"#N/A"},4.1666666666666664E-2]
[null,{"$f":"\"Nabij kruispunt: \"&VLOOKUP(B3,Coordinaten!$A$2:$L$95,4,0)","v":"Nabij kruispunt: N258 / A2"},null,null,null,0.95833333333333337,"-","-","-","-",4.1666666666666664E-2,1,null,null,null,null,0,null,{"$f":"D10","v":"2021-11-16"},{"$f":"E10","v":"19:00 - 02:00u"},{"$f":"IF(F10=0,NA(),F10/$L10)","v":1},{"$f":"IF(G10=0,NA(),G10/$L10)","v":{"$error":"#N/A"}},{"$error":"#N/A"},{"$error":"#N/A"},{"$error":"#N/A"},{"$error":"#N/A"}]
[null,null,null,"2021-11-16","19:00 - 02:00u",9,0,0,0,0,0,9,0,0,0,null,0]
[null,"Meting",null,null,null,1,"-","-","-","-","-",1,null,null,null,null,0]
[null,{"$f":"\"Meetperiode: \"&TEXT(VLOOKUP(B3,Coordinaten!$A$2:$G$95,7,0),\"dddd dd mmmm jjjj\")","v":"Meetperiode: dinsdag 16 november 2021"}]
[null,"Methodiek: Parkeerdrukmeting met waarnemers"]
[null,"In opdracht van: Vlaamse overheid"]
[null,"Uitgevoerd door: Dufec"]
[null,null,null,"VERDELING NAAR CATEGORIE"]
[null,"Locatie"]
[null,{"$f":"IF(B4=\"\",\"\",HYPERLINK(\"http://www.googlemaps.com/?q=\"&B4,\"Lat/Long: \"&B4))","v":"Lat/Long: 50.959801, 4.930284"}]
[]
[null,null,null,null,null,null,null,null,null,null,null,null,null,null,null,"Legenda"]
[null,null,null,null,null,null,null,null,null,null,null,null,null,null,null,null,"Personenwagen"]
[null,null,null,null,null,null,null,null,null,null,null,null,null,null,null,null,"Vracht"]
[null,null,null,null,null,null,null,null,null,null,null,null,null,null,null,null,"Motor"]
[null,null,null,null,null,null,null,null,null,null,null,null,null,null,null,null,"Obstakel / overig"]
[null,null,null,null,null,null,null,null,null,null,null,null,null,null,null,null,"Fout personenwagen"]
[null,null,null,null,null,null,null,null,null,null,null,null,null,null,null,null,"Fout Vracht"]
[]
[]
[]
[]
[]
[]
[]
[]
[]
[]
[]
[null,"Opmerking"]
[null,"Het onderzoek vindt plaats gedurende coronamaatregelen."]
[null,"Dit heeft mogelijk een effect op de resultaten."]
[]
[null,"Toelichting"]
[null,"Pers = personenwagens op daarvoor bestemde"]
[null,"          openbare plaatsen"]
[null,"Vracht = vrachtwagens op daarvoor bestemde"]
[null,"          parkeerplaatsen (middel- en zwaar vrachtverkeer)"]
[null,"Motor = geparkeerde motoren op openbare plaatsen"]
[null,"Obstakel / overig = obstakels of overige voertuigen"]
[null,"          geparkeerd op openbare plaatsen"]
[null,"Fout pers = personenwagens die fout geparkeerd staan"]
[null,"Fout vracht = vrachtwagens die fout geparkeerd staan"]
[null,"E-wagen = geparkeerde elektrisch voertuig bij een"]
[null,"          elektrisch oplaadpunt"]
[null,"Invalide = personenwagens en motoren op voor"]
[null,"          invalide personen bestemde parkeerplaats"]
[null,"Gestalde fietsen = alle gestalde fietsen op de"]
[null,"          daarvoor bestemde parkeerplaatsen"]

{"sheet":"41.Walshoutem","index":39,"n_rows":57,"n_cols":26,"rows_kept":57,"cut":false,"hidden":false,"merged":[[4,3,5,12],[4,16,5,16],[15,3,16,12]]}
[]
[null,"PARKEERONDERZOEK",null,"CARPOOLPARKINGS EN P+R PARKINGS"]
[null,41,null,{"$f":"B8 & \" - \"& TEXT(VLOOKUP(B3,Coordinaten!$A$2:$G$95,7,0),\"dddd dd mmmm jjjj\")","v":"Carpool parking Walshoutem, Landen - dinsdag 16 november 2021"}]
[null,{"$f":"VLOOKUP(B3,Coordinaten!$A$2:$G$95,6,0)","v":"50.713075, 5.081833"}]
[null,null,null,"BEZETTING  ",null,null,null,null,null,null,null,null,null,null,null,null,"OPMERKINGEN"]
[]
[null,"Onderzoeksgebied",null,"Datum","Geregistreerd tussen","Pers","Vracht","Motor","Obstakel / overig","Fout   pers","Fout Vracht","Totaal","E-wagen\nplaats","Invalidenplaats","Gestalde fietsen",null,null,null,null,null,{"$f":"F7","v":"Pers"},"Vracht","Motor","Obstakel / overig","Fout   pers","Fout Vracht"]
[null,{"$f":"VLOOKUP(B3,Coordinaten!$A$2:$G$95,3,0)&\", \"&VLOOKUP(B3,Coordinaten!$A$2:$G$95,5,0)","v":"Carpool parking Walshoutem, Landen"},null,"2021-11-16","09:00 - 16:00u",33,0,0,0,19,0,52,0,1,1,null,0,null,{"$f":"D8","v":"2021-11-16"},{"$f":"E8","v":"09:00 - 16:00u"},{"$f":"IF(F8=0,NA(),F8/$L8)","v":0.63461538461538458},{"$f":"IF(G8=0,NA(),G8/$L8)","v":{"$error":"#N/A"}},{"$f":"IF(H8=0,NA(),H8/$L8)","v":{"$error":"#N/A"}},{"$error":"#N/A"},0.36538461538461536,{"$error":"#N/A"}]
[null,{"$f":"\"Nabij kruispunt: \"&VLOOKUP(B3,Coordinaten!$A$2:$L$95,4,0)","v":"Nabij kruispunt: N80 / A3"},null,null,null,0.63461538461538458,"-","-","-",0.36538461538461536,"-",1,null,null,null,null,0,null,{"$f":"D10","v":"2021-11-16"},{"$f":"E10","v":"19:00 - 02:00u"},{"$f":"IF(F10=0,NA(),F10/$L10)","v":0.7},{"$f":"IF(G10=0,NA(),G10/$L10)","v":{"$error":"#N/A"}},{"$error":"#N/A"},{"$error":"#N/A"},{"$error":"#N/A"},0.3]
[null,null,null,"2021-11-16","19:00 - 02:00u",7,0,0,0,0,3,10,0,0,0,null,0]
[null,"Meting",null,null,null,0.7,"-","-","-","-",0.3,1,null,null,null,null,0]
[null,{"$f":"\"Meetperiode: \"&TEXT(VLOOKUP(B3,Coordinaten!$A$2:$G$95,7,0),\"dddd dd mmmm jjjj\")","v":"Meetperiode: dinsdag 16 november 2021"}]
[null,"Methodiek: Parkeerdrukmeting met waarnemers"]
[null,"In opdracht van: Vlaamse overheid"]
[null,"Uitgevoerd door: Dufec"]
[null,null,null,"VERDELING NAAR CATEGORIE"]
[null,"Locatie"]
[null,{"$f":"IF(B4=\"\",\"\",HYPERLINK(\"http://www.googlemaps.com/?q=\"&B4,\"Lat/Long: \"&B4))","v":"Lat/Long: 50.713075, 5.081833"}]
[]
[null,null,null,null,null,null,null,null,null,null,null,null,null,null,null,"Legenda"]
[null,null,null,null,null,null,null,null,null,null,null,null,null,null,null,null,"Personenwagen"]
[null,null,null,null,null,null,null,null,null,null,null,null,null,null,null,null,"Vracht"]
[null,null,null,null,null,null,null,null,null,null,null,null,null,null,null,null,"Motor"]
[null,null,null,null,null,null,null,null,null,null,null,null,null,null,null,null,"Obstakel / overig"]
[null,null,null,null,null,null,null,null,null,null,null,null,null,null,null,null,"Fout personenwagen"]
[null,null,null,null,null,null,null,null,null,null,null,null,null,null,null,null,"Fout Vracht"]
[]
[]
[]
[]
[]
[]
[]
[]
[]
[]
[]
[null,"Opmerking"]
[null,"Het onderzoek vindt plaats gedurende coronamaatregelen."]
[null,"Dit heeft mogelijk een effect op de resultaten."]
[]
[null,"Toelichting"]
[null,"Pers = personenwagens op daarvoor bestemde"]
[null,"          openbare plaatsen"]
[null,"Vracht = vrachtwagens op daarvoor bestemde"]
[null,"          parkeerplaatsen (middel- en zwaar vrachtverkeer)"]
[null,"Motor = geparkeerde motoren op openbare plaatsen"]
[null,"Obstakel / overig = obstakels of overige voertuigen"]
[null,"          geparkeerd op openbare plaatsen"]
[null,"Fout pers = personenwagens die fout geparkeerd staan"]
[null,"Fout vracht = vrachtwagens die fout geparkeerd staan"]
[null,"E-wagen = geparkeerde elektrisch voertuig bij een"]
[null,"          elektrisch oplaadpunt"]
[null,"Invalide = personenwagens en motoren op voor"]
[null,"          invalide personen bestemde parkeerplaats"]
[null,"Gestalde fietsen = alle gestalde fietsen op de"]
[null,"          daarvoor bestemde parkeerplaatsen"]

{"sheet":"42.Zingem","index":40,"n_rows":57,"n_cols":26,"rows_kept":57,"cut":false,"hidden":false,"merged":[[4,3,5,12],[4,16,5,16],[15,3,16,12]]}
[]
[null,"PARKEERONDERZOEK",null,"CARPOOLPARKINGS EN P+R PARKINGS"]
[null,42,null,{"$f":"B8 & \" - \"& TEXT(VLOOKUP(B3,Coordinaten!$A$2:$G$95,7,0),\"dddd dd mmmm jjjj\")","v":"Carpool parking Zingem, Zingem - dinsdag 23 november 2021"}]
[null,{"$f":"VLOOKUP(B3,Coordinaten!$A$2:$G$95,6,0)","v":"50.909427, 3.615886"}]
[null,null,null,"BEZETTING  ",null,null,null,null,null,null,null,null,null,null,null,null,"OPMERKINGEN"]
[]
[null,"Onderzoeksgebied",null,"Datum","Geregistreerd tussen","Pers","Vracht","Motor","Obstakel / overig","Fout   pers","Fout Vracht","Totaal","E-wagen\nplaats","Invalidenplaats","Gestalde fietsen",null,null,null,null,null,{"$f":"F7","v":"Pers"},"Vracht","Motor","Obstakel / overig","Fout   pers","Fout Vracht"]
[null,{"$f":"VLOOKUP(B3,Coordinaten!$A$2:$G$95,3,0)&\", \"&VLOOKUP(B3,Coordinaten!$A$2:$G$95,5,0)","v":"Carpool parking Zingem, Zingem"},null,"2021-11-23","09:00 - 16:00u",10,0,0,0,0,0,10,0,0,0,null,"Vanaf 20 november nieuwe coronamaatregelen, waaronder verplicht telewerk",null,{"$f":"D8","v":"2021-11-23"},{"$f":"E8","v":"09:00 - 16:00u"},{"$f":"IF(F8=0,NA(),F8/$L8)","v":1},{"$f":"IF(G8=0,NA(),G8/$L8)","v":{"$error":"#N/A"}},{"$f":"IF(H8=0,NA(),H8/$L8)","v":{"$error":"#N/A"}},{"$error":"#N/A"},{"$error":"#N/A"},{"$error":"#N/A"}]
[null,{"$f":"\"Nabij kruispunt: \"&VLOOKUP(B3,Coordinaten!$A$2:$L$95,4,0)","v":"Nabij kruispunt: N435 / N60"},null,null,null,1,"-","-","-","-","-",1,null,null,null,null,0,null,{"$f":"D10","v":"2021-11-23"},{"$f":"E10","v":"19:00 - 02:00u"},{"$f":"IF(F10=0,NA(),F10/$L10)","v":1},{"$f":"IF(G10=0,NA(),G10/$L10)","v":{"$error":"#N/A"}},{"$error":"#N/A"},{"$error":"#N/A"},{"$error":"#N/A"},{"$error":"#N/A"}]
[null,null,null,"2021-11-23","19:00 - 02:00u",7,0,0,0,0,0,7,0,0,0,null,"Vanaf 20 november nieuwe coronamaatregelen, waaronder verplicht telewerk"]
[null,"Meting",null,null,null,1,"-","-","-","-","-",1,null,null,null,null,0]
[null,{"$f":"\"Meetperiode: \"&TEXT(VLOOKUP(B3,Coordinaten!$A$2:$G$95,7,0),\"dddd dd mmmm jjjj\")","v":"Meetperiode: dinsdag 23 november 2021"}]
[null,"Methodiek: Parkeerdrukmeting met waarnemers"]
[null,"In opdracht van: Vlaamse overheid"]
[null,"Uitgevoerd door: Dufec"]
[null,null,null,"VERDELING NAAR CATEGORIE"]
[null,"Locatie"]
[null,{"$f":"IF(B4=\"\",\"\",HYPERLINK(\"http://www.googlemaps.com/?q=\"&B4,\"Lat/Long: \"&B4))","v":"Lat/Long: 50.909427, 3.615886"}]
[]
[null,null,null,null,null,null,null,null,null,null,null,null,null,null,null,"Legenda"]
[null,null,null,null,null,null,null,null,null,null,null,null,null,null,null,null,"Personenwagen"]
[null,null,null,null,null,null,null,null,null,null,null,null,null,null,null,null,"Vracht"]
[null,null,null,null,null,null,null,null,null,null,null,null,null,null,null,null,"Motor"]
[null,null,null,null,null,null,null,null,null,null,null,null,null,null,null,null,"Obstakel / overig"]
[null,null,null,null,null,null,null,null,null,null,null,null,null,null,null,null,"Fout personenwagen"]
[null,null,null,null,null,null,null,null,null,null,null,null,null,null,null,null,"Fout Vracht"]
[]
[]
[]
[]
[]
[]
[]
[]
[]
[]
[]
[null,"Opmerking"]
[null,"Het onderzoek vindt plaats gedurende coronamaatregelen."]
[null,"Dit heeft mogelijk een effect op de resultaten."]
[]
[null,"Toelichting"]
[null,"Pers = personenwagens op daarvoor bestemde"]
[null,"          openbare plaatsen"]
[null,"Vracht = vrachtwagens op daarvoor bestemde"]
[null,"          parkeerplaatsen (middel- en zwaar vrachtverkeer)"]
[null,"Motor = geparkeerde motoren op openbare plaatsen"]
[null,"Obstakel / overig = obstakels of overige voertuigen"]
[null,"          geparkeerd op openbare plaatsen"]
[null,"Fout pers = personenwagens die fout geparkeerd staan"]
[null,"Fout vracht = vrachtwagens die fout geparkeerd staan"]
[null,"E-wagen = geparkeerde elektrisch voertuig bij een"]
[null,"          elektrisch oplaadpunt"]
[null,"Invalide = personenwagens en motoren op voor"]
[null,"          invalide personen bestemde parkeerplaats"]
[null,"Gestalde fietsen = alle gestalde fietsen op de"]
[null,"          daarvoor bestemde parkeerplaatsen"]

{"sheet":"43.Kemzeke-West","index":41,"n_rows":57,"n_cols":26,"rows_kept":57,"cut":false,"hidden":false,"merged":[[4,3,5,12],[4,16,5,16],[15,3,16,12]]}
[]
[null,"PARKEERONDERZOEK",null,"CARPOOLPARKINGS EN P+R PARKINGS"]
[null,43,null,{"$f":"B8 & \" - \"& TEXT(VLOOKUP(B3,Coordinaten!$A$2:$G$95,7,0),\"dddd dd mmmm jjjj\")","v":"Carpool parking Kemzeke-West, Stekene - dinsdag 09 november 2021"}]
[null,{"$f":"VLOOKUP(B3,Coordinaten!$A$2:$G$95,6,0)","v":"51.229594, 4.060439"}]
[null,null,null,"BEZETTING  ",null,null,null,null,null,null,null,null,null,null,null,null,"OPMERKINGEN"]
[]
[null,"Onderzoeksgebied",null,"Datum","Geregistreerd tussen","Pers","Vracht","Motor","Obstakel / overig","Fout   pers","Fout Vracht","Totaal","E-wagen\nplaats","Invalidenplaats","Gestalde fietsen",null,null,null,null,null,{"$f":"F7","v":"Pers"},"Vracht","Motor","Obstakel / overig","Fout   pers","Fout Vracht"]
[null,{"$f":"VLOOKUP(B3,Coordinaten!$A$2:$G$95,3,0)&\", \"&VLOOKUP(B3,Coordinaten!$A$2:$G$95,5,0)","v":"Carpool parking Kemzeke-West, Stekene"},null,"2021-11-09","09:00 - 16:00u",21,0,0,0,1,0,22,0,0,0,null,0,null,{"$f":"D8","v":"2021-11-09"},{"$f":"E8","v":"09:00 - 16:00u"},{"$f":"IF(F8=0,NA(),F8/$L8)","v":0.95454545454545459},{"$f":"IF(G8=0,NA(),G8/$L8)","v":{"$error":"#N/A"}},{"$f":"IF(H8=0,NA(),H8/$L8)","v":{"$error":"#N/A"}},{"$error":"#N/A"},4.5454545454545456E-2,{"$error":"#N/A"}]
[null,{"$f":"\"Nabij kruispunt: \"&VLOOKUP(B3,Coordinaten!$A$2:$L$95,4,0)","v":"Nabij kruispunt: N403 / N49"},null,null,null,0.95454545454545459,"-","-","-",4.5454545454545456E-2,"-",1,null,null,null,null,0,null,{"$f":"D10","v":"2021-11-09"},{"$f":"E10","v":"19:00 - 02:00u"},{"$f":"IF(F10=0,NA(),F10/$L10)","v":1},{"$f":"IF(G10=0,NA(),G10/$L10)","v":{"$error":"#N/A"}},{"$error":"#N/A"},{"$error":"#N/A"},{"$error":"#N/A"},{"$error":"#N/A"}]
[null,null,null,"2021-11-09","19:00 - 02:00u",4,0,0,0,0,0,4,0,0,0,null,0]
[null,"Meting",null,null,null,1,"-","-","-","-","-",1,null,null,null,null,0]
[null,{"$f":"\"Meetperiode: \"&TEXT(VLOOKUP(B3,Coordinaten!$A$2:$G$95,7,0),\"dddd dd mmmm jjjj\")","v":"Meetperiode: dinsdag 09 november 2021"}]
[null,"Methodiek: Parkeerdrukmeting met waarnemers"]
[null,"In opdracht van: Vlaamse overheid"]
[null,"Uitgevoerd door: Dufec"]
[null,null,null,"VERDELING NAAR CATEGORIE"]
[null,"Locatie"]
[null,{"$f":"IF(B4=\"\",\"\",HYPERLINK(\"http://www.googlemaps.com/?q=\"&B4,\"Lat/Long: \"&B4))","v":"Lat/Long: 51.229594, 4.060439"}]
[]
[null,null,null,null,null,null,null,null,null,null,null,null,null,null,null,"Legenda"]
[null,null,null,null,null,null,null,null,null,null,null,null,null,null,null,null,"Personenwagen"]
[null,null,null,null,null,null,null,null,null,null,null,null,null,null,null,null,"Vracht"]
[null,null,null,null,null,null,null,null,null,null,null,null,null,null,null,null,"Motor"]
[null,null,null,null,null,null,null,null,null,null,null,null,null,null,null,null,"Obstakel / overig"]
[null,null,null,null,null,null,null,null,null,null,null,null,null,null,null,null,"Fout personenwagen"]
[null,null,null,null,null,null,null,null,null,null,null,null,null,null,null,null,"Fout Vracht"]
[]
[]
[]
[]
[]
[]
[]
[]
[]
[]
[]
[null,"Opmerking"]
[null,"Het onderzoek vindt plaats gedurende coronamaatregelen."]
[null,"Dit heeft mogelijk een effect op de resultaten."]
[]
[null,"Toelichting"]
[null,"Pers = personenwagens op daarvoor bestemde"]
[null,"          openbare plaatsen"]
[null,"Vracht = vrachtwagens op daarvoor bestemde"]
[null,"          parkeerplaatsen (middel- en zwaar vrachtverkeer)"]
[null,"Motor = geparkeerde motoren op openbare plaatsen"]
[null,"Obstakel / overig = obstakels of overige voertuigen"]
[null,"          geparkeerd op openbare plaatsen"]
[null,"Fout pers = personenwagens die fout geparkeerd staan"]
[null,"Fout vracht = vrachtwagens die fout geparkeerd staan"]
[null,"E-wagen = geparkeerde elektrisch voertuig bij een"]
[null,"          elektrisch oplaadpunt"]
[null,"Invalide = personenwagens en motoren op voor"]
[null,"          invalide personen bestemde parkeerplaats"]
[null,"Gestalde fietsen = alle gestalde fietsen op de"]
[null,"          daarvoor bestemde parkeerplaatsen"]

{"sheet":"44.Kemzeke-Oost","index":42,"n_rows":57,"n_cols":26,"rows_kept":57,"cut":false,"hidden":false,"merged":[[4,3,5,12],[4,16,5,16],[15,3,16,12]]}
[]
[null,"PARKEERONDERZOEK",null,"CARPOOLPARKINGS EN P+R PARKINGS"]
[null,44,null,{"$f":"B8 & \" - \"& TEXT(VLOOKUP(B3,Coordinaten!$A$2:$G$95,7,0),\"dddd dd mmmm jjjj\")","v":"Carpool parking Kemzeke-Oost, Stekene - dinsdag 09 november 2021"}]
[null,{"$f":"VLOOKUP(B3,Coordinaten!$A$2:$G$95,6,0)","v":"51.229783, 4.061087"}]
[null,null,null,"BEZETTING  ",null,null,null,null,null,null,null,null,null,null,null,null,"OPMERKINGEN"]
[]
[null,"Onderzoeksgebied",null,"Datum","Geregistreerd tussen","Pers","Vracht","Motor","Obstakel / overig","Fout   pers","Fout Vracht","Totaal","E-wagen\nplaats","Invalidenplaats","Gestalde fietsen",null,null,null,null,null,{"$f":"F7","v":"Pers"},"Vracht","Motor","Obstakel / overig","Fout   pers","Fout Vracht"]
[null,{"$f":"VLOOKUP(B3,Coordinaten!$A$2:$G$95,3,0)&\", \"&VLOOKUP(B3,Coordinaten!$A$2:$G$95,5,0)","v":"Carpool parking Kemzeke-Oost, Stekene"},null,"2021-11-09","09:00 - 16:00u",2,0,0,0,0,0,2,0,0,0,null,0,null,{"$f":"D8","v":"2021-11-09"},{"$f":"E8","v":"09:00 - 16:00u"},{"$f":"IF(F8=0,NA(),F8/$L8)","v":1},{"$f":"IF(G8=0,NA(),G8/$L8)","v":{"$error":"#N/A"}},{"$f":"IF(H8=0,NA(),H8/$L8)","v":{"$error":"#N/A"}},{"$error":"#N/A"},{"$error":"#N/A"},{"$error":"#N/A"}]
[null,{"$f":"\"Nabij kruispunt: \"&VLOOKUP(B3,Coordinaten!$A$2:$L$95,4,0)","v":"Nabij kruispunt: N403 / N49"},null,null,null,1,"-","-","-","-","-",1,null,null,null,null,0,null,{"$f":"D10","v":"2021-11-09"},{"$f":"E10","v":"19:00 - 02:00u"},{"$f":"IF(F10=0,NA(),F10/$L10)","v":1},{"$f":"IF(G10=0,NA(),G10/$L10)","v":{"$error":"#N/A"}},{"$error":"#N/A"},{"$error":"#N/A"},{"$error":"#N/A"},{"$error":"#N/A"}]
[null,null,null,"2021-11-09","19:00 - 02:00u",2,0,0,0,0,0,2,0,0,0,null,0]
[null,"Meting",null,null,null,1,"-","-","-","-","-",1,null,null,null,null,0]
[null,{"$f":"\"Meetperiode: \"&TEXT(VLOOKUP(B3,Coordinaten!$A$2:$G$95,7,0),\"dddd dd mmmm jjjj\")","v":"Meetperiode: dinsdag 09 november 2021"}]
[null,"Methodiek: Parkeerdrukmeting met waarnemers"]
[null,"In opdracht van: Vlaamse overheid"]
[null,"Uitgevoerd door: Dufec"]
[null,null,null,"VERDELING NAAR CATEGORIE"]
[null,"Locatie"]
[null,{"$f":"IF(B4=\"\",\"\",HYPERLINK(\"http://www.googlemaps.com/?q=\"&B4,\"Lat/Long: \"&B4))","v":"Lat/Long: 51.229783, 4.061087"}]
[]
[null,null,null,null,null,null,null,null,null,null,null,null,null,null,null,"Legenda"]
[null,null,null,null,null,null,null,null,null,null,null,null,null,null,null,null,"Personenwagen"]
[null,null,null,null,null,null,null,null,null,null,null,null,null,null,null,null,"Vracht"]
[null,null,null,null,null,null,null,null,null,null,null,null,null,null,null,null,"Motor"]
[null,null,null,null,null,null,null,null,null,null,null,null,null,null,null,null,"Obstakel / overig"]
[null,null,null,null,null,null,null,null,null,null,null,null,null,null,null,null,"Fout personenwagen"]
[null,null,null,null,null,null,null,null,null,null,null,null,null,null,null,null,"Fout Vracht"]
[]
[]
[]
[]
[]
[]
[]
[]
[]
[]
[]
[null,"Opmerking"]
[null,"Het onderzoek vindt plaats gedurende coronamaatregelen."]
[null,"Dit heeft mogelijk een effect op de resultaten."]
[]
[null,"Toelichting"]
[null,"Pers = personenwagens op daarvoor bestemde"]
[null,"          openbare plaatsen"]
[null,"Vracht = vrachtwagens op daarvoor bestemde"]
[null,"          parkeerplaatsen (middel- en zwaar vrachtverkeer)"]
[null,"Motor = geparkeerde motoren op openbare plaatsen"]
[null,"Obstakel / overig = obstakels of overige voertuigen"]
[null,"          geparkeerd op openbare plaatsen"]
[null,"Fout pers = personenwagens die fout geparkeerd staan"]
[null,"Fout vracht = vrachtwagens die fout geparkeerd staan"]
[null,"E-wagen = geparkeerde elektrisch voertuig bij een"]
[null,"          elektrisch oplaadpunt"]
[null,"Invalide = personenwagens en motoren op voor"]
[null,"          invalide personen bestemde parkeerplaats"]
[null,"Gestalde fietsen = alle gestalde fietsen op de"]
[null,"          daarvoor bestemde parkeerplaatsen"]

{"sheet":"45.Wommelgem-Noord","index":43,"n_rows":57,"n_cols":26,"rows_kept":57,"cut":false,"hidden":false,"merged":[[4,3,5,12],[4,16,5,16],[15,3,16,12]]}
[]
[null,"PARKEERONDERZOEK",null,"CARPOOLPARKINGS EN P+R PARKINGS"]
[null,45,null,{"$f":"B8 & \" - \"& TEXT(VLOOKUP(B3,Coordinaten!$A$2:$G$95,7,0),\"dddd dd mmmm jjjj\")","v":"P+R parking Wommelgem-Noord, Wommelgem - donderdag 18 november 2021"}]
[null,{"$f":"VLOOKUP(B3,Coordinaten!$A$2:$G$95,6,0)","v":"51.212489, 4.491956"}]
[null,null,null,"BEZETTING  ",null,null,null,null,null,null,null,null,null,null,null,null,"OPMERKINGEN"]
[]
[null,"Onderzoeksgebied",null,"Datum","Geregistreerd tussen","Pers","Vracht","Motor","Obstakel / overig","Fout   pers","Fout Vracht","Totaal","E-wagen\nplaats","Invalidenplaats","Gestalde fietsen",null,null,null,null,null,{"$f":"F7","v":"Pers"},"Vracht","Motor","Obstakel / overig","Fout   pers","Fout Vracht"]
[null,{"$f":"VLOOKUP(B3,Coordinaten!$A$2:$G$95,3,0)&\", \"&VLOOKUP(B3,Coordinaten!$A$2:$G$95,5,0)","v":"P+R parking Wommelgem-Noord, Wommelgem"},null,"2021-11-18","09:00 - 16:00u",140,0,0,1,2,0,143,1,0,6,null,0,null,{"$f":"D8","v":"2021-11-18"},{"$f":"E8","v":"09:00 - 16:00u"},{"$f":"IF(F8=0,NA(),F8/$L8)","v":0.97902097902097907},{"$f":"IF(G8=0,NA(),G8/$L8)","v":{"$error":"#N/A"}},{"$f":"IF(H8=0,NA(),H8/$L8)","v":{"$error":"#N/A"}},6.993006993006993E-3,1.3986013986013986E-2,{"$error":"#N/A"}]
[null,{"$f":"\"Nabij kruispunt: \"&VLOOKUP(B3,Coordinaten!$A$2:$L$95,4,0)","v":"Nabij kruispunt: R11 / A13"},null,null,null,0.97902097902097907,"-","-",6.993006993006993E-3,1.3986013986013986E-2,"-",1,null,null,null,null,0,null,{"$f":"D10","v":"2021-11-18"},{"$f":"E10","v":"19:00 - 02:00u"},{"$f":"IF(F10=0,NA(),F10/$L10)","v":0.99038461538461542},{"$f":"IF(G10=0,NA(),G10/$L10)","v":{"$error":"#N/A"}},{"$error":"#N/A"},9.6153846153846159E-3,{"$error":"#N/A"},{"$error":"#N/A"}]
[null,null,null,"2021-11-18","19:00 - 02:00u",103,0,0,1,0,0,104,0,0,2,null,0]
[null,"Meting",null,null,null,0.99038461538461542,"-","-",9.6153846153846159E-3,"-","-",1,null,null,null,null,0]
[null,{"$f":"\"Meetperiode: \"&TEXT(VLOOKUP(B3,Coordinaten!$A$2:$G$95,7,0),\"dddd dd mmmm jjjj\")","v":"Meetperiode: donderdag 18 november 2021"}]
[null,"Methodiek: Parkeerdrukmeting met waarnemers"]
[null,"In opdracht van: Vlaamse overheid"]
[null,"Uitgevoerd door: Dufec"]
[null,null,null,"VERDELING NAAR CATEGORIE"]
[null,"Locatie"]
[null,{"$f":"IF(B4=\"\",\"\",HYPERLINK(\"http://www.googlemaps.com/?q=\"&B4,\"Lat/Long: \"&B4))","v":"Lat/Long: 51.212489, 4.491956"}]
[]
[null,null,null,null,null,null,null,null,null,null,null,null,null,null,null,"Legenda"]
[null,null,null,null,null,null,null,null,null,null,null,null,null,null,null,null,"Personenwagen"]
[null,null,null,null,null,null,null,null,null,null,null,null,null,null,null,null,"Vracht"]
[null,null,null,null,null,null,null,null,null,null,null,null,null,null,null,null,"Motor"]
[null,null,null,null,null,null,null,null,null,null,null,null,null,null,null,null,"Obstakel / overig"]
[null,null,null,null,null,null,null,null,null,null,null,null,null,null,null,null,"Fout personenwagen"]
[null,null,null,null,null,null,null,null,null,null,null,null,null,null,null,null,"Fout Vracht"]
[]
[]
[]
[]
[]
[]
[]
[]
[]
[]
[]
[null,"Opmerking"]
[null,"Het onderzoek vindt plaats gedurende coronamaatregelen."]
[null,"Dit heeft mogelijk een effect op de resultaten."]
[]
[null,"Toelichting"]
[null,"Pers = personenwagens op daarvoor bestemde"]
[null,"          openbare plaatsen"]
[null,"Vracht = vrachtwagens op daarvoor bestemde"]
[null,"          parkeerplaatsen (middel- en zwaar vrachtverkeer)"]
[null,"Motor = geparkeerde motoren op openbare plaatsen"]
[null,"Obstakel / overig = obstakels of overige voertuigen"]
[null,"          geparkeerd op openbare plaatsen"]
[null,"Fout pers = personenwagens die fout geparkeerd staan"]
[null,"Fout vracht = vrachtwagens die fout geparkeerd staan"]
[null,"E-wagen = geparkeerde elektrisch voertuig bij een"]
[null,"          elektrisch oplaadpunt"]
[null,"Invalide = personenwagens en motoren op voor"]
[null,"          invalide personen bestemde parkeerplaats"]
[null,"Gestalde fietsen = alle gestalde fietsen op de"]
[null,"          daarvoor bestemde parkeerplaatsen"]

{"sheet":"47.Lille","index":44,"n_rows":57,"n_cols":26,"rows_kept":57,"cut":false,"hidden":false,"merged":[[4,3,5,12],[4,16,5,16],[15,3,16,12]]}
[]
[null,"PARKEERONDERZOEK",null,"CARPOOLPARKINGS EN P+R PARKINGS"]
[null,47,null,{"$f":"B8 & \" - \"& TEXT(VLOOKUP(B3,Coordinaten!$A$2:$G$95,7,0),\"dddd dd mmmm jjjj\")","v":"Carpool parking Lille, Lille - donderdag 18 november 2021"}]
[null,{"$f":"VLOOKUP(B3,Coordinaten!$A$2:$G$95,6,0)","v":"51.254780, 4.807767"}]
[null,null,null,"BEZETTING  ",null,null,null,null,null,null,null,null,null,null,null,null,"OPMERKINGEN"]
[]
[null,"Onderzoeksgebied",null,"Datum","Geregistreerd tussen","Pers","Vracht","Motor","Obstakel / overig","Fout   pers","Fout Vracht","Totaal","E-wagen\nplaats","Invalidenplaats","Gestalde fietsen",null,null,null,null,null,{"$f":"F7","v":"Pers"},"Vracht","Motor","Obstakel / overig","Fout   pers","Fout Vracht"]
[null,{"$f":"VLOOKUP(B3,Coordinaten!$A$2:$G$95,3,0)&\", \"&VLOOKUP(B3,Coordinaten!$A$2:$G$95,5,0)","v":"Carpool parking Lille, Lille"},null,"2021-11-18","09:00 - 16:00u",47,0,1,0,0,2,50,0,0,9,null,0,null,{"$f":"D8","v":"2021-11-18"},{"$f":"E8","v":"09:00 - 16:00u"},{"$f":"IF(F8=0,NA(),F8/$L8)","v":0.94},{"$f":"IF(G8=0,NA(),G8/$L8)","v":{"$error":"#N/A"}},{"$f":"IF(H8=0,NA(),H8/$L8)","v":0.02},{"$error":"#N/A"},{"$error":"#N/A"},0.04]
[null,{"$f":"\"Nabij kruispunt: \"&VLOOKUP(B3,Coordinaten!$A$2:$L$95,4,0)","v":"Nabij kruispunt: N153 / A21"},null,null,null,0.94,"-",0.02,"-","-",0.04,1,null,null,null,null,0,null,{"$f":"D10","v":"2021-11-18"},{"$f":"E10","v":"19:00 - 02:00u"},{"$f":"IF(F10=0,NA(),F10/$L10)","v":0.52380952380952384},{"$f":"IF(G10=0,NA(),G10/$L10)","v":{"$error":"#N/A"}},{"$error":"#N/A"},9.5238095238095233E-2,{"$error":"#N/A"},0.38095238095238093]
[null,null,null,"2021-11-18","19:00 - 02:00u",11,0,0,2,0,8,21,0,0,6,null,0]
[null,"Meting",null,null,null,0.52380952380952384,"-","-",9.5238095238095233E-2,"-",0.38095238095238093,1,null,null,null,null,0]
[null,{"$f":"\"Meetperiode: \"&TEXT(VLOOKUP(B3,Coordinaten!$A$2:$G$95,7,0),\"dddd dd mmmm jjjj\")","v":"Meetperiode: donderdag 18 november 2021"}]
[null,"Methodiek: Parkeerdrukmeting met waarnemers"]
[null,"In opdracht van: Vlaamse overheid"]
[null,"Uitgevoerd door: Dufec"]
[null,null,null,"VERDELING NAAR CATEGORIE"]
[null,"Locatie"]
[null,{"$f":"IF(B4=\"\",\"\",HYPERLINK(\"http://www.googlemaps.com/?q=\"&B4,\"Lat/Long: \"&B4))","v":"Lat/Long: 51.254780, 4.807767"}]
[]
[null,null,null,null,null,null,null,null,null,null,null,null,null,null,null,"Legenda"]
[null,null,null,null,null,null,null,null,null,null,null,null,null,null,null,null,"Personenwagen"]
[null,null,null,null,null,null,null,null,null,null,null,null,null,null,null,null,"Vracht"]
[null,null,null,null,null,null,null,null,null,null,null,null,null,null,null,null,"Motor"]
[null,null,null,null,null,null,null,null,null,null,null,null,null,null,null,null,"Obstakel / overig"]
[null,null,null,null,null,null,null,null,null,null,null,null,null,null,null,null,"Fout personenwagen"]
[null,null,null,null,null,null,null,null,null,null,null,null,null,null,null,null,"Fout Vracht"]
[]
[]
[]
[]
[]
[]
[]
[]
[]
[]
[]
[null,"Opmerking"]
[null,"Het onderzoek vindt plaats gedurende coronamaatregelen."]
[null,"Dit heeft mogelijk een effect op de resultaten."]
[]
[null,"Toelichting"]
[null,"Pers = personenwagens op daarvoor bestemde"]
[null,"          openbare plaatsen"]
[null,"Vracht = vrachtwagens op daarvoor bestemde"]
[null,"          parkeerplaatsen (middel- en zwaar vrachtverkeer)"]
[null,"Motor = geparkeerde motoren op openbare plaatsen"]
[null,"Obstakel / overig = obstakels of overige voertuigen"]
[null,"          geparkeerd op openbare plaatsen"]
[null,"Fout pers = personenwagens die fout geparkeerd staan"]
[null,"Fout vracht = vrachtwagens die fout geparkeerd staan"]
[null,"E-wagen = geparkeerde elektrisch voertuig bij een"]
[null,"          elektrisch oplaadpunt"]
[null,"Invalide = personenwagens en motoren op voor"]
[null,"          invalide personen bestemde parkeerplaats"]
[null,"Gestalde fietsen = alle gestalde fietsen op de"]
[null,"          daarvoor bestemde parkeerplaatsen"]

{"sheet":"48.Oelegem-West","index":45,"n_rows":57,"n_cols":26,"rows_kept":57,"cut":false,"hidden":false,"merged":[[4,3,5,12],[4,16,5,16],[15,3,16,12]]}
[]
[null,"PARKEERONDERZOEK",null,"CARPOOLPARKINGS EN P+R PARKINGS"]
[null,48,null,{"$f":"B8 & \" - \"& TEXT(VLOOKUP(B3,Coordinaten!$A$2:$G$95,7,0),\"dddd dd mmmm jjjj\")","v":"Carpool parking Oelegem-West, Ranst - donderdag 18 november 2021"}]
[null,{"$f":"VLOOKUP(B3,Coordinaten!$A$2:$G$95,6,0)","v":"51.212044, 4.623777"}]
[null,null,null,"BEZETTING  ",null,null,null,null,null,null,null,null,null,null,null,null,"OPMERKINGEN"]
[]
[null,"Onderzoeksgebied",null,"Datum","Geregistreerd tussen","Pers","Vracht","Motor","Obstakel / overig","Fout   pers","Fout Vracht","Totaal","E-wagen\nplaats","Invalidenplaats","Gestalde fietsen",null,null,null,null,null,{"$f":"F7","v":"Pers"},"Vracht","Motor","Obstakel / overig","Fout   pers","Fout Vracht"]
[null,{"$f":"VLOOKUP(B3,Coordinaten!$A$2:$G$95,3,0)&\", \"&VLOOKUP(B3,Coordinaten!$A$2:$G$95,5,0)","v":"Carpool parking Oelegem-West, Ranst"},null,"2021-11-18","09:00 - 16:00u",11,0,0,0,0,0,11,0,0,0,null,0,null,{"$f":"D8","v":"2021-11-18"},{"$f":"E8","v":"09:00 - 16:00u"},{"$f":"IF(F8=0,NA(),F8/$L8)","v":1},{"$f":"IF(G8=0,NA(),G8/$L8)","v":{"$error":"#N/A"}},{"$f":"IF(H8=0,NA(),H8/$L8)","v":{"$error":"#N/A"}},{"$error":"#N/A"},{"$error":"#N/A"},{"$error":"#N/A"}]
[null,{"$f":"\"Nabij kruispunt: \"&VLOOKUP(B3,Coordinaten!$A$2:$L$95,4,0)","v":"Nabij kruispunt: A21 / Zandhovensesteenweg"},null,null,null,1,"-","-","-","-","-",1,null,null,null,null,0,null,{"$f":"D10","v":"2021-11-18"},{"$f":"E10","v":"19:00 - 02:00u"},{"$f":"IF(F10=0,NA(),F10/$L10)","v":1},{"$f":"IF(G10=0,NA(),G10/$L10)","v":{"$error":"#N/A"}},{"$error":"#N/A"},{"$error":"#N/A"},{"$error":"#N/A"},{"$error":"#N/A"}]
[null,null,null,"2021-11-18","19:00 - 02:00u",1,0,0,0,0,0,1,0,0,0,null,0]
[null,"Meting",null,null,null,1,"-","-","-","-","-",1,null,null,null,null,0]
[null,{"$f":"\"Meetperiode: \"&TEXT(VLOOKUP(B3,Coordinaten!$A$2:$G$95,7,0),\"dddd dd mmmm jjjj\")","v":"Meetperiode: donderdag 18 november 2021"}]
[null,"Methodiek: Parkeerdrukmeting met waarnemers"]
[null,"In opdracht van: Vlaamse overheid"]
[null,"Uitgevoerd door: Dufec"]
[null,null,null,"VERDELING NAAR CATEGORIE"]
[null,"Locatie"]
[null,{"$f":"IF(B4=\"\",\"\",HYPERLINK(\"http://www.googlemaps.com/?q=\"&B4,\"Lat/Long: \"&B4))","v":"Lat/Long: 51.212044, 4.623777"}]
[]
[null,null,null,null,null,null,null,null,null,null,null,null,null,null,null,"Legenda"]
[null,null,null,null,null,null,null,null,null,null,null,null,null,null,null,null,"Personenwagen"]
[null,null,null,null,null,null,null,null,null,null,null,null,null,null,null,null,"Vracht"]
[null,null,null,null,null,null,null,null,null,null,null,null,null,null,null,null,"Motor"]
[null,null,null,null,null,null,null,null,null,null,null,null,null,null,null,null,"Obstakel / overig"]
[null,null,null,null,null,null,null,null,null,null,null,null,null,null,null,null,"Fout personenwagen"]
[null,null,null,null,null,null,null,null,null,null,null,null,null,null,null,null,"Fout Vracht"]
[]
[]
[]
[]
[]
[]
[]
[]
[]
[]
[]
[null,"Opmerking"]
[null,"Het onderzoek vindt plaats gedurende coronamaatregelen."]
[null,"Dit heeft mogelijk een effect op de resultaten."]
[]
[null,"Toelichting"]
[null,"Pers = personenwagens op daarvoor bestemde"]
[null,"          openbare plaatsen"]
[null,"Vracht = vrachtwagens op daarvoor bestemde"]
[null,"          parkeerplaatsen (middel- en zwaar vrachtverkeer)"]
[null,"Motor = geparkeerde motoren op openbare plaatsen"]
[null,"Obstakel / overig = obstakels of overige voertuigen"]
[null,"          geparkeerd op openbare plaatsen"]
[null,"Fout pers = personenwagens die fout geparkeerd staan"]
[null,"Fout vracht = vrachtwagens die fout geparkeerd staan"]
[null,"E-wagen = geparkeerde elektrisch voertuig bij een"]
[null,"          elektrisch oplaadpunt"]
[null,"Invalide = personenwagens en motoren op voor"]
[null,"          invalide personen bestemde parkeerplaats"]
[null,"Gestalde fietsen = alle gestalde fietsen op de"]
[null,"          daarvoor bestemde parkeerplaatsen"]

{"sheet":"49.Oelegem-Oost","index":46,"n_rows":57,"n_cols":26,"rows_kept":57,"cut":false,"hidden":false,"merged":[[4,3,5,12],[4,16,5,16],[15,3,16,12]]}
[]
[null,"PARKEERONDERZOEK",null,"CARPOOLPARKINGS EN P+R PARKINGS"]
[null,49,null,{"$f":"B8 & \" - \"& TEXT(VLOOKUP(B3,Coordinaten!$A$2:$G$95,7,0),\"dddd dd mmmm jjjj\")","v":"Carpool parking Oelegem-Oost, Ranst - donderdag 18 november 2021"}]
[null,{"$f":"VLOOKUP(B3,Coordinaten!$A$2:$G$95,6,0)","v":"51.211693, 4.625380"}]
[null,null,null,"BEZETTING  ",null,null,null,null,null,null,null,null,null,null,null,null,"OPMERKINGEN"]
[]
[null,"Onderzoeksgebied",null,"Datum","Geregistreerd tussen","Pers","Vracht","Motor","Obstakel / overig","Fout   pers","Fout Vracht","Totaal","E-wagen\nplaats","Invalidenplaats","Gestalde fietsen",null,null,null,null,null,{"$f":"F7","v":"Pers"},"Vracht","Motor","Obstakel / overig","Fout   pers","Fout Vracht"]
[null,{"$f":"VLOOKUP(B3,Coordinaten!$A$2:$G$95,3,0)&\", \"&VLOOKUP(B3,Coordinaten!$A$2:$G$95,5,0)","v":"Carpool parking Oelegem-Oost, Ranst"},null,"2021-11-18","09:00 - 16:00u",9,0,0,0,0,0,9,0,0,0,null,0,null,{"$f":"D8","v":"2021-11-18"},{"$f":"E8","v":"09:00 - 16:00u"},{"$f":"IF(F8=0,NA(),F8/$L8)","v":1},{"$f":"IF(G8=0,NA(),G8/$L8)","v":{"$error":"#N/A"}},{"$f":"IF(H8=0,NA(),H8/$L8)","v":{"$error":"#N/A"}},{"$error":"#N/A"},{"$error":"#N/A"},{"$error":"#N/A"}]
[null,{"$f":"\"Nabij kruispunt: \"&VLOOKUP(B3,Coordinaten!$A$2:$L$95,4,0)","v":"Nabij kruispunt: A21 / Zandhovensesteenweg"},null,null,null,1,"-","-","-","-","-",1,null,null,null,null,0,null,{"$f":"D10","v":"2021-11-18"},{"$f":"E10","v":"19:00 - 02:00u"},{"$f":"IF(F10=0,NA(),F10/$L10)","v":1},{"$f":"IF(G10=0,NA(),G10/$L10)","v":{"$error":"#N/A"}},{"$error":"#N/A"},{"$error":"#N/A"},{"$error":"#N/A"},{"$error":"#N/A"}]
[null,null,null,"2021-11-18","19:00 - 02:00u",13,0,0,0,0,0,13,0,0,0,null,0]
[null,"Meting",null,null,null,1,"-","-","-","-","-",1,null,null,null,null,0]
[null,{"$f":"\"Meetperiode: \"&TEXT(VLOOKUP(B3,Coordinaten!$A$2:$G$95,7,0),\"dddd dd mmmm jjjj\")","v":"Meetperiode: donderdag 18 november 2021"}]
[null,"Methodiek: Parkeerdrukmeting met waarnemers"]
[null,"In opdracht van: Vlaamse overheid"]
[null,"Uitgevoerd door: Dufec"]
[null,null,null,"VERDELING NAAR CATEGORIE"]
[null,"Locatie"]
[null,{"$f":"IF(B4=\"\",\"\",HYPERLINK(\"http://www.googlemaps.com/?q=\"&B4,\"Lat/Long: \"&B4))","v":"Lat/Long: 51.211693, 4.625380"}]
[]
[null,null,null,null,null,null,null,null,null,null,null,null,null,null,null,"Legenda"]
[null,null,null,null,null,null,null,null,null,null,null,null,null,null,null,null,"Personenwagen"]
[null,null,null,null,null,null,null,null,null,null,null,null,null,null,null,null,"Vracht"]
[null,null,null,null,null,null,null,null,null,null,null,null,null,null,null,null,"Motor"]
[null,null,null,null,null,null,null,null,null,null,null,null,null,null,null,null,"Obstakel / overig"]
[null,null,null,null,null,null,null,null,null,null,null,null,null,null,null,null,"Fout personenwagen"]
[null,null,null,null,null,null,null,null,null,null,null,null,null,null,null,null,"Fout Vracht"]
[]
[]
[]
[]
[]
[]
[]
[]
[]
[]
[]
[null,"Opmerking"]
[null,"Het onderzoek vindt plaats gedurende coronamaatregelen."]
[null,"Dit heeft mogelijk een effect op de resultaten."]
[]
[null,"Toelichting"]
[null,"Pers = personenwagens op daarvoor bestemde"]
[null,"          openbare plaatsen"]
[null,"Vracht = vrachtwagens op daarvoor bestemde"]
[null,"          parkeerplaatsen (middel- en zwaar vrachtverkeer)"]
[null,"Motor = geparkeerde motoren op openbare plaatsen"]
[null,"Obstakel / overig = obstakels of overige voertuigen"]
[null,"          geparkeerd op openbare plaatsen"]
[null,"Fout pers = personenwagens die fout geparkeerd staan"]
[null,"Fout vracht = vrachtwagens die fout geparkeerd staan"]
[null,"E-wagen = geparkeerde elektrisch voertuig bij een"]
[null,"          elektrisch oplaadpunt"]
[null,"Invalide = personenwagens en motoren op voor"]
[null,"          invalide personen bestemde parkeerplaats"]
[null,"Gestalde fietsen = alle gestalde fietsen op de"]
[null,"          daarvoor bestemde parkeerplaatsen"]

{"sheet":"50.Sint Job in 't Goor","index":47,"n_rows":57,"n_cols":26,"rows_kept":57,"cut":false,"hidden":false,"merged":[[4,3,5,12],[4,16,5,16],[15,3,16,12]]}
[]
[null,"PARKEERONDERZOEK",null,"CARPOOLPARKINGS EN P+R PARKINGS"]
[null,50,null,{"$f":"B8 & \" - \"& TEXT(VLOOKUP(B3,Coordinaten!$A$2:$G$95,7,0),\"dddd dd mmmm jjjj\")","v":"P+R parking Sint Job in 't Goor, Brasschaat - dinsdag 09 november 2021"}]
[null,{"$f":"VLOOKUP(B3,Coordinaten!$A$2:$G$95,6,0)","v":"51.309564, 4.555137"}]
[null,null,null,"BEZETTING  ",null,null,null,null,null,null,null,null,null,null,null,null,"OPMERKINGEN"]
[]
[null,"Onderzoeksgebied",null,"Datum","Geregistreerd tussen","Pers","Vracht","Motor","Obstakel / overig","Fout   pers","Fout Vracht","Totaal","E-wagen\nplaats","Invalidenplaats","Gestalde fietsen",null,null,null,null,null,{"$f":"F7","v":"Pers"},"Vracht","Motor","Obstakel / overig","Fout   pers","Fout Vracht"]
[null,{"$f":"VLOOKUP(B3,Coordinaten!$A$2:$G$95,3,0)&\", \"&VLOOKUP(B3,Coordinaten!$A$2:$G$95,5,0)","v":"P+R parking Sint Job in 't Goor, Brasschaat"},null,"2021-11-09","09:00 - 16:00u",55,10,0,0,0,4,69,0,0,2,null,0,null,{"$f":"D8","v":"2021-11-09"},{"$f":"E8","v":"09:00 - 16:00u"},{"$f":"IF(F8=0,NA(),F8/$L8)","v":0.79710144927536231},{"$f":"IF(G8=0,NA(),G8/$L8)","v":0.14492753623188406},{"$f":"IF(H8=0,NA(),H8/$L8)","v":{"$error":"#N/A"}},{"$error":"#N/A"},{"$error":"#N/A"},5.7971014492753624E-2]
[null,{"$f":"\"Nabij kruispunt: \"&VLOOKUP(B3,Coordinaten!$A$2:$L$95,4,0)","v":"Nabij kruispunt: N117 / A1"},null,null,null,0.79710144927536231,0.14492753623188406,"-","-","-",5.7971014492753624E-2,1,null,null,null,null,0,null,{"$f":"D10","v":"2021-11-09"},{"$f":"E10","v":"19:00 - 02:00u"},{"$f":"IF(F10=0,NA(),F10/$L10)","v":0.86486486486486491},{"$f":"IF(G10=0,NA(),G10/$L10)","v":{"$error":"#N/A"}},{"$error":"#N/A"},{"$error":"#N/A"},8.1081081081081086E-2,5.4054054054054057E-2]
[null,null,null,"2021-11-09","19:00 - 02:00u",32,0,0,0,3,2,37,0,0,0,null,0]
[null,"Meting",null,null,null,0.86486486486486491,"-","-","-",8.1081081081081086E-2,5.4054054054054057E-2,1,null,null,null,null,0]
[null,{"$f":"\"Meetperiode: \"&TEXT(VLOOKUP(B3,Coordinaten!$A$2:$G$95,7,0),\"dddd dd mmmm jjjj\")","v":"Meetperiode: dinsdag 09 november 2021"}]
[null,"Methodiek: Parkeerdrukmeting met waarnemers"]
[null,"In opdracht van: Vlaamse overheid"]
[null,"Uitgevoerd door: Dufec"]
[null,null,null,"VERDELING NAAR CATEGORIE"]
[null,"Locatie"]
[null,{"$f":"IF(B4=\"\",\"\",HYPERLINK(\"http://www.googlemaps.com/?q=\"&B4,\"Lat/Long: \"&B4))","v":"Lat/Long: 51.309564, 4.555137"}]
[]
[null,null,null,null,null,null,null,null,null,null,null,null,null,null,null,"Legenda"]
[null,null,null,null,null,null,null,null,null,null,null,null,null,null,null,null,"Personenwagen"]
[null,null,null,null,null,null,null,null,null,null,null,null,null,null,null,null,"Vracht"]
[null,null,null,null,null,null,null,null,null,null,null,null,null,null,null,null,"Motor"]
[null,null,null,null,null,null,null,null,null,null,null,null,null,null,null,null,"Obstakel / overig"]
[null,null,null,null,null,null,null,null,null,null,null,null,null,null,null,null,"Fout personenwagen"]
[null,null,null,null,null,null,null,null,null,null,null,null,null,null,null,null,"Fout Vracht"]
[]
[]
[]
[]
[]
[]
[]
[]
[]
[]
[]
[null,"Opmerking"]
[null,"Het onderzoek vindt plaats gedurende coronamaatregelen."]
[null,"Dit heeft mogelijk een effect op de resultaten."]
[]
[null,"Toelichting"]
[null,"Pers = personenwagens op daarvoor bestemde"]
[null,"          openbare plaatsen"]
[null,"Vracht = vrachtwagens op daarvoor bestemde"]
[null,"          parkeerplaatsen (middel- en zwaar vrachtverkeer)"]
[null,"Motor = geparkeerde motoren op openbare plaatsen"]
[null,"Obstakel / overig = obstakels of overige voertuigen"]
[null,"          geparkeerd op openbare plaatsen"]
[null,"Fout pers = personenwagens die fout geparkeerd staan"]
[null,"Fout vracht = vrachtwagens die fout geparkeerd staan"]
[null,"E-wagen = geparkeerde elektrisch voertuig bij een"]
[null,"          elektrisch oplaadpunt"]
[null,"Invalide = personenwagens en motoren op voor"]
[null,"          invalide personen bestemde parkeerplaats"]
[null,"Gestalde fietsen = alle gestalde fietsen op de"]
[null,"          daarvoor bestemde parkeerplaatsen"]

{"sheet":"51.Menen","index":48,"n_rows":57,"n_cols":26,"rows_kept":57,"cut":false,"hidden":false,"merged":[[4,3,5,12],[4,16,5,16],[15,3,16,12]]}
[]
[null,"PARKEERONDERZOEK",null,"CARPOOLPARKINGS EN P+R PARKINGS"]
[null,51,null,{"$f":"B8 & \" - \"& TEXT(VLOOKUP(B3,Coordinaten!$A$2:$G$95,7,0),\"dddd dd mmmm jjjj\")","v":"Carpool parking Menen, Menen - dinsdag 23 november 2021"}]
[null,{"$f":"VLOOKUP(B3,Coordinaten!$A$2:$G$95,6,0)","v":"50.817106, 3.125718"}]
[null,null,null,"BEZETTING  ",null,null,null,null,null,null,null,null,null,null,null,null,"OPMERKINGEN"]
[]
[null,"Onderzoeksgebied",null,"Datum","Geregistreerd tussen","Pers","Vracht","Motor","Obstakel / overig","Fout   pers","Fout Vracht","Totaal","E-wagen\nplaats","Invalidenplaats","Gestalde fietsen",null,null,null,null,null,{"$f":"F7","v":"Pers"},"Vracht","Motor","Obstakel / overig","Fout   pers","Fout Vracht"]
[null,{"$f":"VLOOKUP(B3,Coordinaten!$A$2:$G$95,3,0)&\", \"&VLOOKUP(B3,Coordinaten!$A$2:$G$95,5,0)","v":"Carpool parking Menen, Menen"},null,"2021-11-23","09:00 - 16:00u",31,0,0,0,0,0,31,0,0,4,null,"Vanaf 20 november nieuwe coronamaatregelen, waaronder verplicht telewerk",null,{"$f":"D8","v":"2021-11-23"},{"$f":"E8","v":"09:00 - 16:00u"},{"$f":"IF(F8=0,NA(),F8/$L8)","v":1},{"$f":"IF(G8=0,NA(),G8/$L8)","v":{"$error":"#N/A"}},{"$f":"IF(H8=0,NA(),H8/$L8)","v":{"$error":"#N/A"}},{"$error":"#N/A"},{"$error":"#N/A"},{"$error":"#N/A"}]
[null,{"$f":"\"Nabij kruispunt: \"&VLOOKUP(B3,Coordinaten!$A$2:$L$95,4,0)","v":"Nabij kruispunt: A19 / N32"},null,null,null,1,"-","-","-","-","-",1,null,null,null,null,0,null,{"$f":"D10","v":"2021-11-23"},{"$f":"E10","v":"19:00 - 02:00u"},{"$f":"IF(F10=0,NA(),F10/$L10)","v":1},{"$f":"IF(G10=0,NA(),G10/$L10)","v":{"$error":"#N/A"}},{"$error":"#N/A"},{"$error":"#N/A"},{"$error":"#N/A"},{"$error":"#N/A"}]
[null,null,null,"2021-11-23","19:00 - 02:00u",14,0,0,0,0,0,14,0,0,0,null,"Vanaf 20 november nieuwe coronamaatregelen, waaronder verplicht telewerk"]
[null,"Meting",null,null,null,1,"-","-","-","-","-",1,null,null,null,null,0]
[null,{"$f":"\"Meetperiode: \"&TEXT(VLOOKUP(B3,Coordinaten!$A$2:$G$95,7,0),\"dddd dd mmmm jjjj\")","v":"Meetperiode: dinsdag 23 november 2021"}]
[null,"Methodiek: Parkeerdrukmeting met waarnemers"]
[null,"In opdracht van: Vlaamse overheid"]
[null,"Uitgevoerd door: Dufec"]
[null,null,null,"VERDELING NAAR CATEGORIE"]
[null,"Locatie"]
[null,{"$f":"IF(B4=\"\",\"\",HYPERLINK(\"http://www.googlemaps.com/?q=\"&B4,\"Lat/Long: \"&B4))","v":"Lat/Long: 50.817106, 3.125718"}]
[]
[null,null,null,null,null,null,null,null,null,null,null,null,null,null,null,"Legenda"]
[null,null,null,null,null,null,null,null,null,null,null,null,null,null,null,null,"Personenwagen"]
[null,null,null,null,null,null,null,null,null,null,null,null,null,null,null,null,"Vracht"]
[null,null,null,null,null,null,null,null,null,null,null,null,null,null,null,null,"Motor"]
[null,null,null,null,null,null,null,null,null,null,null,null,null,null,null,null,"Obstakel / overig"]
[null,null,null,null,null,null,null,null,null,null,null,null,null,null,null,null,"Fout personenwagen"]
[null,null,null,null,null,null,null,null,null,null,null,null,null,null,null,null,"Fout Vracht"]
[]
[]
[]
[]
[]
[]
[]
[]
[]
[]
[]
[null,"Opmerking"]
[null,"Het onderzoek vindt plaats gedurende coronamaatregelen."]
[null,"Dit heeft mogelijk een effect op de resultaten."]
[]
[null,"Toelichting"]
[null,"Pers = personenwagens op daarvoor bestemde"]
[null,"          openbare plaatsen"]
[null,"Vracht = vrachtwagens op daarvoor bestemde"]
[null,"          parkeerplaatsen (middel- en zwaar vrachtverkeer)"]
[null,"Motor = geparkeerde motoren op openbare plaatsen"]
[null,"Obstakel / overig = obstakels of overige voertuigen"]
[null,"          geparkeerd op openbare plaatsen"]
[null,"Fout pers = personenwagens die fout geparkeerd staan"]
[null,"Fout vracht = vrachtwagens die fout geparkeerd staan"]
[null,"E-wagen = geparkeerde elektrisch voertuig bij een"]
[null,"          elektrisch oplaadpunt"]
[null,"Invalide = personenwagens en motoren op voor"]
[null,"          invalide personen bestemde parkeerplaats"]
[null,"Gestalde fietsen = alle gestalde fietsen op de"]
[null,"          daarvoor bestemde parkeerplaatsen"]

{"sheet":"52.Deerlijk","index":49,"n_rows":57,"n_cols":26,"rows_kept":57,"cut":false,"hidden":false,"merged":[[4,3,5,12],[4,16,5,16],[15,3,16,12]]}
[]
[null,"PARKEERONDERZOEK",null,"CARPOOLPARKINGS EN P+R PARKINGS"]
[null,52,null,{"$f":"B8 & \" - \"& TEXT(VLOOKUP(B3,Coordinaten!$A$2:$G$95,7,0),\"dddd dd mmmm jjjj\")","v":"Carpool parking Deerlijk, Deerlijk - dinsdag 23 november 2021"}]
[null,{"$f":"VLOOKUP(B3,Coordinaten!$A$2:$G$95,6,0)","v":"50.850190, 3.368235"}]
[null,null,null,"BEZETTING  ",null,null,null,null,null,null,null,null,null,null,null,null,"OPMERKINGEN"]
[]
[null,"Onderzoeksgebied",null,"Datum","Geregistreerd tussen","Pers","Vracht","Motor","Obstakel / overig","Fout   pers","Fout Vracht","Totaal","E-wagen\nplaats","Invalidenplaats","Gestalde fietsen",null,null,null,null,null,{"$f":"F7","v":"Pers"},"Vracht","Motor","Obstakel / overig","Fout   pers","Fout Vracht"]
[null,{"$f":"VLOOKUP(B3,Coordinaten!$A$2:$G$95,3,0)&\", \"&VLOOKUP(B3,Coordinaten!$A$2:$G$95,5,0)","v":"Carpool parking Deerlijk, Deerlijk"},null,"2021-11-23","09:00 - 16:00u",46,0,0,0,0,0,46,0,0,5,null,"Vanaf 20 november nieuwe coronamaatregelen, waaronder verplicht telewerk",null,{"$f":"D8","v":"2021-11-23"},{"$f":"E8","v":"09:00 - 16:00u"},{"$f":"IF(F8=0,NA(),F8/$L8)","v":1},{"$f":"IF(G8=0,NA(),G8/$L8)","v":{"$error":"#N/A"}},{"$f":"IF(H8=0,NA(),H8/$L8)","v":{"$error":"#N/A"}},{"$error":"#N/A"},{"$error":"#N/A"},{"$error":"#N/A"}]
[null,{"$f":"\"Nabij kruispunt: \"&VLOOKUP(B3,Coordinaten!$A$2:$L$95,4,0)","v":"Nabij kruispunt: N36 / Vichtesteenweg"},null,null,null,1,"-","-","-","-","-",1,null,null,null,null,0,null,{"$f":"D10","v":"2021-11-23"},{"$f":"E10","v":"19:00 - 02:00u"},{"$f":"IF(F10=0,NA(),F10/$L10)","v":1},{"$f":"IF(G10=0,NA(),G10/$L10)","v":{"$error":"#N/A"}},{"$error":"#N/A"},{"$error":"#N/A"},{"$error":"#N/A"},{"$error":"#N/A"}]
[null,null,null,"2021-11-23","19:00 - 02:00u",15,0,0,0,0,0,15,0,0,0,null,"Vanaf 20 november nieuwe coronamaatregelen, waaronder verplicht telewerk"]
[null,"Meting",null,null,null,1,"-","-","-","-","-",1,null,null,null,null,0]
[null,{"$f":"\"Meetperiode: \"&TEXT(VLOOKUP(B3,Coordinaten!$A$2:$G$95,7,0),\"dddd dd mmmm jjjj\")","v":"Meetperiode: dinsdag 23 november 2021"}]
[null,"Methodiek: Parkeerdrukmeting met waarnemers"]
[null,"In opdracht van: Vlaamse overheid"]
[null,"Uitgevoerd door: Dufec"]
[null,null,null,"VERDELING NAAR CATEGORIE"]
[null,"Locatie"]
[null,{"$f":"IF(B4=\"\",\"\",HYPERLINK(\"http://www.googlemaps.com/?q=\"&B4,\"Lat/Long: \"&B4))","v":"Lat/Long: 50.850190, 3.368235"}]
[]
[null,null,null,null,null,null,null,null,null,null,null,null,null,null,null,"Legenda"]
[null,null,null,null,null,null,null,null,null,null,null,null,null,null,null,null,"Personenwagen"]
[null,null,null,null,null,null,null,null,null,null,null,null,null,null,null,null,"Vracht"]
[null,null,null,null,null,null,null,null,null,null,null,null,null,null,null,null,"Motor"]
[null,null,null,null,null,null,null,null,null,null,null,null,null,null,null,null,"Obstakel / overig"]
[null,null,null,null,null,null,null,null,null,null,null,null,null,null,null,null,"Fout personenwagen"]
[null,null,null,null,null,null,null,null,null,null,null,null,null,null,null,null,"Fout Vracht"]
[]
[]
[]
[]
[]
[]
[]
[]
[]
[]
[]
[null,"Opmerking"]
[null,"Het onderzoek vindt plaats gedurende coronamaatregelen."]
[null,"Dit heeft mogelijk een effect op de resultaten."]
[]
[null,"Toelichting"]
[null,"Pers = personenwagens op daarvoor bestemde"]
[null,"          openbare plaatsen"]
[null,"Vracht = vrachtwagens op daarvoor bestemde"]
[null,"          parkeerplaatsen (middel- en zwaar vrachtverkeer)"]
[null,"Motor = geparkeerde motoren op openbare plaatsen"]
[null,"Obstakel / overig = obstakels of overige voertuigen"]
[null,"          geparkeerd op openbare plaatsen"]
[null,"Fout pers = personenwagens die fout geparkeerd staan"]
[null,"Fout vracht = vrachtwagens die fout geparkeerd staan"]
[null,"E-wagen = geparkeerde elektrisch voertuig bij een"]
[null,"          elektrisch oplaadpunt"]
[null,"Invalide = personenwagens en motoren op voor"]
[null,"          invalide personen bestemde parkeerplaats"]
[null,"Gestalde fietsen = alle gestalde fietsen op de"]
[null,"          daarvoor bestemde parkeerplaatsen"]

{"sheet":"53.Zoersel","index":50,"n_rows":57,"n_cols":26,"rows_kept":57,"cut":false,"hidden":false,"merged":[[4,3,5,12],[4,16,5,16],[15,3,16,12]]}
[]
[null,"PARKEERONDERZOEK",null,"CARPOOLPARKINGS EN P+R PARKINGS"]
[null,53,null,{"$f":"B8 & \" - \"& TEXT(VLOOKUP(B3,Coordinaten!$A$2:$G$95,7,0),\"dddd dd mmmm jjjj\")","v":"Carpool parking Zoersel, Zoersel - donderdag 18 november 2021"}]
[null,{"$f":"VLOOKUP(B3,Coordinaten!$A$2:$G$95,6,0)","v":"51.245282, 4.703352"}]
[null,null,null,"BEZETTING  ",null,null,null,null,null,null,null,null,null,null,null,null,"OPMERKINGEN"]
[]
[null,"Onderzoeksgebied",null,"Datum","Geregistreerd tussen","Pers","Vracht","Motor","Obstakel / overig","Fout   pers","Fout Vracht","Totaal","E-wagen\nplaats","Invalidenplaats","Gestalde fietsen",null,null,null,null,null,{"$f":"F7","v":"Pers"},"Vracht","Motor","Obstakel / overig","Fout   pers","Fout Vracht"]
[null,{"$f":"VLOOKUP(B3,Coordinaten!$A$2:$G$95,3,0)&\", \"&VLOOKUP(B3,Coordinaten!$A$2:$G$95,5,0)","v":"Carpool parking Zoersel, Zoersel"},null,"2021-11-18","09:00 - 16:00u",55,0,0,0,6,0,61,0,0,11,null,0,null,{"$f":"D8","v":"2021-11-18"},{"$f":"E8","v":"09:00 - 16:00u"},{"$f":"IF(F8=0,NA(),F8/$L8)","v":0.90163934426229508},{"$f":"IF(G8=0,NA(),G8/$L8)","v":{"$error":"#N/A"}},{"$f":"IF(H8=0,NA(),H8/$L8)","v":{"$error":"#N/A"}},{"$error":"#N/A"},9.8360655737704916E-2,{"$error":"#N/A"}]
[null,{"$f":"\"Nabij kruispunt: \"&VLOOKUP(B3,Coordinaten!$A$2:$L$95,4,0)","v":"Nabij kruispunt: N14 / A21"},null,null,null,0.90163934426229508,"-","-","-",9.8360655737704916E-2,"-",1,null,null,null,null,0,null,{"$f":"D10","v":"2021-11-18"},{"$f":"E10","v":"19:00 - 02:00u"},{"$f":"IF(F10=0,NA(),F10/$L10)","v":1},{"$f":"IF(G10=0,NA(),G10/$L10)","v":{"$error":"#N/A"}},{"$error":"#N/A"},{"$error":"#N/A"},{"$error":"#N/A"},{"$error":"#N/A"}]
[null,null,null,"2021-11-18","19:00 - 02:00u",17,0,0,0,0,0,17,0,0,3,null,0]
[null,"Meting",null,null,null,1,"-","-","-","-","-",1,null,null,null,null,0]
[null,{"$f":"\"Meetperiode: \"&TEXT(VLOOKUP(B3,Coordinaten!$A$2:$G$95,7,0),\"dddd dd mmmm jjjj\")","v":"Meetperiode: donderdag 18 november 2021"}]
[null,"Methodiek: Parkeerdrukmeting met waarnemers"]
[null,"In opdracht van: Vlaamse overheid"]
[null,"Uitgevoerd door: Dufec"]
[null,null,null,"VERDELING NAAR CATEGORIE"]
[null,"Locatie"]
[null,{"$f":"IF(B4=\"\",\"\",HYPERLINK(\"http://www.googlemaps.com/?q=\"&B4,\"Lat/Long: \"&B4))","v":"Lat/Long: 51.245282, 4.703352"}]
[]
[null,null,null,null,null,null,null,null,null,null,null,null,null,null,null,"Legenda"]
[null,null,null,null,null,null,null,null,null,null,null,null,null,null,null,null,"Personenwagen"]
[null,null,null,null,null,null,null,null,null,null,null,null,null,null,null,null,"Vracht"]
[null,null,null,null,null,null,null,null,null,null,null,null,null,null,null,null,"Motor"]
[null,null,null,null,null,null,null,null,null,null,null,null,null,null,null,null,"Obstakel / overig"]
[null,null,null,null,null,null,null,null,null,null,null,null,null,null,null,null,"Fout personenwagen"]
[null,null,null,null,null,null,null,null,null,null,null,null,null,null,null,null,"Fout Vracht"]
[]
[]
[]
[]
[]
[]
[]
[]
[]
[]
[]
[null,"Opmerking"]
[null,"Het onderzoek vindt plaats gedurende coronamaatregelen."]
[null,"Dit heeft mogelijk een effect op de resultaten."]
[]
[null,"Toelichting"]
[null,"Pers = personenwagens op daarvoor bestemde"]
[null,"          openbare plaatsen"]
[null,"Vracht = vrachtwagens op daarvoor bestemde"]
[null,"          parkeerplaatsen (middel- en zwaar vrachtverkeer)"]
[null,"Motor = geparkeerde motoren op openbare plaatsen"]
[null,"Obstakel / overig = obstakels of overige voertuigen"]
[null,"          geparkeerd op openbare plaatsen"]
[null,"Fout pers = personenwagens die fout geparkeerd staan"]
[null,"Fout vracht = vrachtwagens die fout geparkeerd staan"]
[null,"E-wagen = geparkeerde elektrisch voertuig bij een"]
[null,"          elektrisch oplaadpunt"]
[null,"Invalide = personenwagens en motoren op voor"]
[null,"          invalide personen bestemde parkeerplaats"]
[null,"Gestalde fietsen = alle gestalde fietsen op de"]
[null,"          daarvoor bestemde parkeerplaatsen"]

{"sheet":"54.E17 Deinze","index":51,"n_rows":57,"n_cols":26,"rows_kept":57,"cut":false,"hidden":false,"merged":[[4,3,5,12],[4,16,5,16],[15,3,16,12]]}
[]
[null,"PARKEERONDERZOEK",null,"CARPOOLPARKINGS EN P+R PARKINGS"]
[null,54,null,{"$f":"B8 & \" - \"& TEXT(VLOOKUP(B3,Coordinaten!$A$2:$G$95,7,0),\"dddd dd mmmm jjjj\")","v":"Carpool parking E17 Deinze, Nazareth - dinsdag 23 november 2021"}]
[null,{"$f":"VLOOKUP(B3,Coordinaten!$A$2:$G$95,6,0)","v":"50.952738, 3.569722"}]
[null,null,null,"BEZETTING  ",null,null,null,null,null,null,null,null,null,null,null,null,"OPMERKINGEN"]
[]
[null,"Onderzoeksgebied",null,"Datum","Geregistreerd tussen","Pers","Vracht","Motor","Obstakel / overig","Fout   pers","Fout Vracht","Totaal","E-wagen\nplaats","Invalidenplaats","Gestalde fietsen",null,null,null,null,null,{"$f":"F7","v":"Pers"},"Vracht","Motor","Obstakel / overig","Fout   pers","Fout Vracht"]
[null,{"$f":"VLOOKUP(B3,Coordinaten!$A$2:$G$95,3,0)&\", \"&VLOOKUP(B3,Coordinaten!$A$2:$G$95,5,0)","v":"Carpool parking E17 Deinze, Nazareth"},null,"2021-11-23","09:00 - 16:00u",21,0,0,0,0,0,21,0,0,18,null,"Vanaf 20 november nieuwe coronamaatregelen, waaronder verplicht telewerk",null,{"$f":"D8","v":"2021-11-23"},{"$f":"E8","v":"09:00 - 16:00u"},{"$f":"IF(F8=0,NA(),F8/$L8)","v":1},{"$f":"IF(G8=0,NA(),G8/$L8)","v":{"$error":"#N/A"}},{"$f":"IF(H8=0,NA(),H8/$L8)","v":{"$error":"#N/A"}},{"$error":"#N/A"},{"$error":"#N/A"},{"$error":"#N/A"}]
[null,{"$f":"\"Nabij kruispunt: \"&VLOOKUP(B3,Coordinaten!$A$2:$L$95,4,0)","v":"Nabij kruispunt: N35 / N17"},null,null,null,1,"-","-","-","-","-",1,null,null,null,null,0,null,{"$f":"D10","v":"2021-11-23"},{"$f":"E10","v":"19:00 - 02:00u"},{"$f":"IF(F10=0,NA(),F10/$L10)","v":1},{"$f":"IF(G10=0,NA(),G10/$L10)","v":{"$error":"#N/A"}},{"$error":"#N/A"},{"$error":"#N/A"},{"$error":"#N/A"},{"$error":"#N/A"}]
[null,null,null,"2021-11-23","19:00 - 02:00u",15,0,0,0,0,0,15,0,0,0,null,"Vanaf 20 november nieuwe coronamaatregelen, waaronder verplicht telewerk"]
[null,"Meting",null,null,null,1,"-","-","-","-","-",1,null,null,null,null,0]
[null,{"$f":"\"Meetperiode: \"&TEXT(VLOOKUP(B3,Coordinaten!$A$2:$G$95,7,0),\"dddd dd mmmm jjjj\")","v":"Meetperiode: dinsdag 23 november 2021"}]
[null,"Methodiek: Parkeerdrukmeting met waarnemers"]
[null,"In opdracht van: Vlaamse overheid"]
[null,"Uitgevoerd door: Dufec"]
[null,null,null,"VERDELING NAAR CATEGORIE"]
[null,"Locatie"]
[null,{"$f":"IF(B4=\"\",\"\",HYPERLINK(\"http://www.googlemaps.com/?q=\"&B4,\"Lat/Long: \"&B4))","v":"Lat/Long: 50.952738, 3.569722"}]
[]
[null,null,null,null,null,null,null,null,null,null,null,null,null,null,null,"Legenda"]
[null,null,null,null,null,null,null,null,null,null,null,null,null,null,null,null,"Personenwagen"]
[null,null,null,null,null,null,null,null,null,null,null,null,null,null,null,null,"Vracht"]
[null,null,null,null,null,null,null,null,null,null,null,null,null,null,null,null,"Motor"]
[null,null,null,null,null,null,null,null,null,null,null,null,null,null,null,null,"Obstakel / overig"]
[null,null,null,null,null,null,null,null,null,null,null,null,null,null,null,null,"Fout personenwagen"]
[null,null,null,null,null,null,null,null,null,null,null,null,null,null,null,null,"Fout Vracht"]
[]
[]
[]
[]
[]
[]
[]
[]
[]
[]
[]
[null,"Opmerking"]
[null,"Het onderzoek vindt plaats gedurende coronamaatregelen."]
[null,"Dit heeft mogelijk een effect op de resultaten."]
[]
[null,"Toelichting"]
[null,"Pers = personenwagens op daarvoor bestemde"]
[null,"          openbare plaatsen"]
[null,"Vracht = vrachtwagens op daarvoor bestemde"]
[null,"          parkeerplaatsen (middel- en zwaar vrachtverkeer)"]
[null,"Motor = geparkeerde motoren op openbare plaatsen"]
[null,"Obstakel / overig = obstakels of overige voertuigen"]
[null,"          geparkeerd op openbare plaatsen"]
[null,"Fout pers = personenwagens die fout geparkeerd staan"]
[null,"Fout vracht = vrachtwagens die fout geparkeerd staan"]
[null,"E-wagen = geparkeerde elektrisch voertuig bij een"]
[null,"          elektrisch oplaadpunt"]
[null,"Invalide = personenwagens en motoren op voor"]
[null,"          invalide personen bestemde parkeerplaats"]
[null,"Gestalde fietsen = alle gestalde fietsen op de"]
[null,"          daarvoor bestemde parkeerplaatsen"]

{"sheet":"55.Erpe-Mere","index":52,"n_rows":57,"n_cols":26,"rows_kept":57,"cut":false,"hidden":false,"merged":[[4,3,5,12],[4,16,5,16],[15,3,16,12]]}
[]
[null,"PARKEERONDERZOEK",null,"CARPOOLPARKINGS EN P+R PARKINGS"]
[null,55,null,{"$f":"B8 & \" - \"& TEXT(VLOOKUP(B3,Coordinaten!$A$2:$G$95,7,0),\"dddd dd mmmm jjjj\")","v":"Carpool parking Erpe-Mere, Erpe-Mere - dinsdag 23 november 2021"}]
[null,{"$f":"VLOOKUP(B3,Coordinaten!$A$2:$G$95,6,0)","v":"50.927985, 3.958209"}]
[null,null,null,"BEZETTING  ",null,null,null,null,null,null,null,null,null,null,null,null,"OPMERKINGEN"]
[]
[null,"Onderzoeksgebied",null,"Datum","Geregistreerd tussen","Pers","Vracht","Motor","Obstakel / overig","Fout   pers","Fout Vracht","Totaal","E-wagen\nplaats","Invalidenplaats","Gestalde fietsen",null,null,null,null,null,{"$f":"F7","v":"Pers"},"Vracht","Motor","Obstakel / overig","Fout   pers","Fout Vracht"]
[null,{"$f":"VLOOKUP(B3,Coordinaten!$A$2:$G$95,3,0)&\", \"&VLOOKUP(B3,Coordinaten!$A$2:$G$95,5,0)","v":"Carpool parking Erpe-Mere, Erpe-Mere"},null,"2021-11-23","09:00 - 16:00u",66,0,0,0,0,1,67,0,0,3,null,"Vanaf 20 november nieuwe coronamaatregelen, waaronder verplicht telewerk",null,{"$f":"D8","v":"2021-11-23"},{"$f":"E8","v":"09:00 - 16:00u"},{"$f":"IF(F8=0,NA(),F8/$L8)","v":0.9850746268656716},{"$f":"IF(G8=0,NA(),G8/$L8)","v":{"$error":"#N/A"}},{"$f":"IF(H8=0,NA(),H8/$L8)","v":{"$error":"#N/A"}},{"$error":"#N/A"},{"$error":"#N/A"},1.4925373134328358E-2]
[null,{"$f":"\"Nabij kruispunt: \"&VLOOKUP(B3,Coordinaten!$A$2:$L$95,4,0)","v":"Nabij kruispunt: N46 / A10"},null,null,null,0.9850746268656716,"-","-","-","-",1.4925373134328358E-2,1,null,null,null,null,0,null,{"$f":"D10","v":"2021-11-23"},{"$f":"E10","v":"19:00 - 02:00u"},{"$f":"IF(F10=0,NA(),F10/$L10)","v":1},{"$f":"IF(G10=0,NA(),G10/$L10)","v":{"$error":"#N/A"}},{"$error":"#N/A"},{"$error":"#N/A"},{"$error":"#N/A"},{"$error":"#N/A"}]
[null,null,null,"2021-11-23","19:00 - 02:00u",123,0,0,0,0,0,123,0,0,34,null,"Vanaf 20 november nieuwe coronamaatregelen, waaronder verplicht telewerk"]
[null,"Meting",null,null,null,1,"-","-","-","-","-",1,null,null,null,null,0]
[null,{"$f":"\"Meetperiode: \"&TEXT(VLOOKUP(B3,Coordinaten!$A$2:$G$95,7,0),\"dddd dd mmmm jjjj\")","v":"Meetperiode: dinsdag 23 november 2021"}]
[null,"Methodiek: Parkeerdrukmeting met waarnemers"]
[null,"In opdracht van: Vlaamse overheid"]
[null,"Uitgevoerd door: Dufec"]
[null,null,null,"VERDELING NAAR CATEGORIE"]
[null,"Locatie"]
[null,{"$f":"IF(B4=\"\",\"\",HYPERLINK(\"http://www.googlemaps.com/?q=\"&B4,\"Lat/Long: \"&B4))","v":"Lat/Long: 50.927985, 3.958209"}]
[]
[null,null,null,null,null,null,null,null,null,null,null,null,null,null,null,"Legenda"]
[null,null,null,null,null,null,null,null,null,null,null,null,null,null,null,null,"Personenwagen"]
[null,null,null,null,null,null,null,null,null,null,null,null,null,null,null,null,"Vracht"]
[null,null,null,null,null,null,null,null,null,null,null,null,null,null,null,null,"Motor"]
[null,null,null,null,null,null,null,null,null,null,null,null,null,null,null,null,"Obstakel / overig"]
[null,null,null,null,null,null,null,null,null,null,null,null,null,null,null,null,"Fout personenwagen"]
[null,null,null,null,null,null,null,null,null,null,null,null,null,null,null,null,"Fout Vracht"]
[]
[]
[]
[]
[]
[]
[]
[]
[]
[]
[]
[null,"Opmerking"]
[null,"Het onderzoek vindt plaats gedurende coronamaatregelen."]
[null,"Dit heeft mogelijk een effect op de resultaten."]
[]
[null,"Toelichting"]
[null,"Pers = personenwagens op daarvoor bestemde"]
[null,"          openbare plaatsen"]
[null,"Vracht = vrachtwagens op daarvoor bestemde"]
[null,"          parkeerplaatsen (middel- en zwaar vrachtverkeer)"]
[null,"Motor = geparkeerde motoren op openbare plaatsen"]
[null,"Obstakel / overig = obstakels of overige voertuigen"]
[null,"          geparkeerd op openbare plaatsen"]
[null,"Fout pers = personenwagens die fout geparkeerd staan"]
[null,"Fout vracht = vrachtwagens die fout geparkeerd staan"]
[null,"E-wagen = geparkeerde elektrisch voertuig bij een"]
[null,"          elektrisch oplaadpunt"]
[null,"Invalide = personenwagens en motoren op voor"]
[null,"          invalide personen bestemde parkeerplaats"]
[null,"Gestalde fietsen = alle gestalde fietsen op de"]
[null,"          daarvoor bestemde parkeerplaatsen"]

{"sheet":"56.Geel-West","index":53,"n_rows":57,"n_cols":26,"rows_kept":57,"cut":false,"hidden":false,"merged":[[4,3,5,12],[4,16,5,16],[15,3,16,12]]}
[]
[null,"PARKEERONDERZOEK",null,"CARPOOLPARKINGS EN P+R PARKINGS"]
[null,56,null,{"$f":"B8 & \" - \"& TEXT(VLOOKUP(B3,Coordinaten!$A$2:$G$95,7,0),\"dddd dd mmmm jjjj\")","v":"Carpool parking Geel-West, Westerlo - donderdag 18 november 2021"}]
[null,{"$f":"VLOOKUP(B3,Coordinaten!$A$2:$G$95,6,0)","v":"51.133020, 4.940494"}]
[null,null,null,"BEZETTING  ",null,null,null,null,null,null,null,null,null,null,null,null,"OPMERKINGEN"]
[]
[null,"Onderzoeksgebied",null,"Datum","Geregistreerd tussen","Pers","Vracht","Motor","Obstakel / overig","Fout   pers","Fout Vracht","Totaal","E-wagen\nplaats","Invalidenplaats","Gestalde fietsen",null,null,null,null,null,{"$f":"F7","v":"Pers"},"Vracht","Motor","Obstakel / overig","Fout   pers","Fout Vracht"]
[null,{"$f":"VLOOKUP(B3,Coordinaten!$A$2:$G$95,3,0)&\", \"&VLOOKUP(B3,Coordinaten!$A$2:$G$95,5,0)","v":"Carpool parking Geel-West, Westerlo"},null,"2021-11-18","09:00 - 16:00u",67,9,0,0,0,2,78,0,0,6,null,0,null,{"$f":"D8","v":"2021-11-18"},{"$f":"E8","v":"09:00 - 16:00u"},{"$f":"IF(F8=0,NA(),F8/$L8)","v":0.85897435897435892},{"$f":"IF(G8=0,NA(),G8/$L8)","v":0.11538461538461539},{"$f":"IF(H8=0,NA(),H8/$L8)","v":{"$error":"#N/A"}},{"$error":"#N/A"},{"$error":"#N/A"},2.564102564102564E-2]
[null,{"$f":"\"Nabij kruispunt: \"&VLOOKUP(B3,Coordinaten!$A$2:$L$95,4,0)","v":"Nabij kruispunt: N19 / Bell-Telephonelaan"},null,null,null,0.85897435897435892,0.11538461538461539,"-","-","-",2.564102564102564E-2,1,null,null,null,null,0,null,{"$f":"D10","v":"2021-11-18"},{"$f":"E10","v":"19:00 - 02:00u"},{"$f":"IF(F10=0,NA(),F10/$L10)","v":1},{"$f":"IF(G10=0,NA(),G10/$L10)","v":{"$error":"#N/A"}},{"$error":"#N/A"},{"$error":"#N/A"},{"$error":"#N/A"},{"$error":"#N/A"}]
[null,null,null,"2021-11-18","19:00 - 02:00u",14,0,0,0,0,0,14,0,0,8,null,0]
[null,"Meting",null,null,null,1,"-","-","-","-","-",1,null,null,null,null,0]
[null,{"$f":"\"Meetperiode: \"&TEXT(VLOOKUP(B3,Coordinaten!$A$2:$G$95,7,0),\"dddd dd mmmm jjjj\")","v":"Meetperiode: donderdag 18 november 2021"}]
[null,"Methodiek: Parkeerdrukmeting met waarnemers"]
[null,"In opdracht van: Vlaamse overheid"]
[null,"Uitgevoerd door: Dufec"]
[null,null,null,"VERDELING NAAR CATEGORIE"]
[null,"Locatie"]
[null,{"$f":"IF(B4=\"\",\"\",HYPERLINK(\"http://www.googlemaps.com/?q=\"&B4,\"Lat/Long: \"&B4))","v":"Lat/Long: 51.133020, 4.940494"}]
[]
[null,null,null,null,null,null,null,null,null,null,null,null,null,null,null,"Legenda"]
[null,null,null,null,null,null,null,null,null,null,null,null,null,null,null,null,"Personenwagen"]
[null,null,null,null,null,null,null,null,null,null,null,null,null,null,null,null,"Vracht"]
[null,null,null,null,null,null,null,null,null,null,null,null,null,null,null,null,"Motor"]
[null,null,null,null,null,null,null,null,null,null,null,null,null,null,null,null,"Obstakel / overig"]
[null,null,null,null,null,null,null,null,null,null,null,null,null,null,null,null,"Fout personenwagen"]
[null,null,null,null,null,null,null,null,null,null,null,null,null,null,null,null,"Fout Vracht"]
[]
[]
[]
[]
[]
[]
[]
[]
[]
[]
[]
[null,"Opmerking"]
[null,"Het onderzoek vindt plaats gedurende coronamaatregelen."]
[null,"Dit heeft mogelijk een effect op de resultaten."]
[]
[null,"Toelichting"]
[null,"Pers = personenwagens op daarvoor bestemde"]
[null,"          openbare plaatsen"]
[null,"Vracht = vrachtwagens op daarvoor bestemde"]
[null,"          parkeerplaatsen (middel- en zwaar vrachtverkeer)"]
[null,"Motor = geparkeerde motoren op openbare plaatsen"]
[null,"Obstakel / overig = obstakels of overige voertuigen"]
[null,"          geparkeerd op openbare plaatsen"]
[null,"Fout pers = personenwagens die fout geparkeerd staan"]
[null,"Fout vracht = vrachtwagens die fout geparkeerd staan"]
[null,"E-wagen = geparkeerde elektrisch voertuig bij een"]
[null,"          elektrisch oplaadpunt"]
[null,"Invalide = personenwagens en motoren op voor"]
[null,"          invalide personen bestemde parkeerplaats"]
[null,"Gestalde fietsen = alle gestalde fietsen op de"]
[null,"          daarvoor bestemde parkeerplaatsen"]

{"sheet":"57.Veurne","index":54,"n_rows":57,"n_cols":26,"rows_kept":57,"cut":false,"hidden":false,"merged":[[4,3,5,12],[4,16,5,16],[15,3,16,12]]}
[]
[null,"PARKEERONDERZOEK",null,"CARPOOLPARKINGS EN P+R PARKINGS"]
[null,57,null,{"$f":"B8 & \" - \"& TEXT(VLOOKUP(B3,Coordinaten!$A$2:$G$95,7,0),\"dddd dd mmmm jjjj\")","v":"Carpool parking Veurne, Veurne - dinsdag 09 november 2021"}]
[null,{"$f":"VLOOKUP(B3,Coordinaten!$A$2:$G$95,6,0)","v":"51.070372, 2.656499"}]
[null,null,null,"BEZETTING  ",null,null,null,null,null,null,null,null,null,null,null,null,"OPMERKINGEN"]
[]
[null,"Onderzoeksgebied",null,"Datum","Geregistreerd tussen","Pers","Vracht","Motor","Obstakel / overig","Fout   pers","Fout Vracht","Totaal","E-wagen\nplaats","Invalidenplaats","Gestalde fietsen",null,null,null,null,null,{"$f":"F7","v":"Pers"},"Vracht","Motor","Obstakel / overig","Fout   pers","Fout Vracht"]
[null,{"$f":"VLOOKUP(B3,Coordinaten!$A$2:$G$95,3,0)&\", \"&VLOOKUP(B3,Coordinaten!$A$2:$G$95,5,0)","v":"Carpool parking Veurne, Veurne"},null,"2021-11-09","09:00 - 16:00u",32,0,0,1,1,0,34,0,0,0,null,"Obstakel: aanhanger",null,{"$f":"D8","v":"2021-11-09"},{"$f":"E8","v":"09:00 - 16:00u"},{"$f":"IF(F8=0,NA(),F8/$L8)","v":0.94117647058823528},{"$f":"IF(G8=0,NA(),G8/$L8)","v":{"$error":"#N/A"}},{"$f":"IF(H8=0,NA(),H8/$L8)","v":{"$error":"#N/A"}},2.9411764705882353E-2,2.9411764705882353E-2,{"$error":"#N/A"}]
[null,{"$f":"\"Nabij kruispunt: \"&VLOOKUP(B3,Coordinaten!$A$2:$L$95,4,0)","v":"Nabij kruispunt: N39 / N8"},null,null,null,0.94117647058823528,"-","-",2.9411764705882353E-2,2.9411764705882353E-2,"-",1,null,null,null,null,0,null,{"$f":"D10","v":"2021-11-09"},{"$f":"E10","v":"19:00 - 02:00u"},{"$f":"IF(F10=0,NA(),F10/$L10)","v":0.66666666666666663},{"$f":"IF(G10=0,NA(),G10/$L10)","v":{"$error":"#N/A"}},{"$error":"#N/A"},{"$error":"#N/A"},{"$error":"#N/A"},0.33333333333333331]
[null,null,null,"2021-11-09","19:00 - 02:00u",2,0,0,0,0,1,3,0,0,0,null,0]
[null,"Meting",null,null,null,0.66666666666666663,"-","-","-","-",0.33333333333333331,1,null,null,null,null,0]
[null,{"$f":"\"Meetperiode: \"&TEXT(VLOOKUP(B3,Coordinaten!$A$2:$G$95,7,0),\"dddd dd mmmm jjjj\")","v":"Meetperiode: dinsdag 09 november 2021"}]
[null,"Methodiek: Parkeerdrukmeting met waarnemers"]
[null,"In opdracht van: Vlaamse overheid"]
[null,"Uitgevoerd door: Dufec"]
[null,null,null,"VERDELING NAAR CATEGORIE"]
[null,"Locatie"]
[null,{"$f":"IF(B4=\"\",\"\",HYPERLINK(\"http://www.googlemaps.com/?q=\"&B4,\"Lat/Long: \"&B4))","v":"Lat/Long: 51.070372, 2.656499"}]
[]
[null,null,null,null,null,null,null,null,null,null,null,null,null,null,null,"Legenda"]
[null,null,null,null,null,null,null,null,null,null,null,null,null,null,null,null,"Personenwagen"]
[null,null,null,null,null,null,null,null,null,null,null,null,null,null,null,null,"Vracht"]
[null,null,null,null,null,null,null,null,null,null,null,null,null,null,null,null,"Motor"]
[null,null,null,null,null,null,null,null,null,null,null,null,null,null,null,null,"Obstakel / overig"]
[null,null,null,null,null,null,null,null,null,null,null,null,null,null,null,null,"Fout personenwagen"]
[null,null,null,null,null,null,null,null,null,null,null,null,null,null,null,null,"Fout Vracht"]
[]
[]
[]
[]
[]
[]
[]
[]
[]
[]
[]
[null,"Opmerking"]
[null,"Het onderzoek vindt plaats gedurende coronamaatregelen."]
[null,"Dit heeft mogelijk een effect op de resultaten."]
[]
[null,"Toelichting"]
[null,"Pers = personenwagens op daarvoor bestemde"]
[null,"          openbare plaatsen"]
[null,"Vracht = vrachtwagens op daarvoor bestemde"]
[null,"          parkeerplaatsen (middel- en zwaar vrachtverkeer)"]
[null,"Motor = geparkeerde motoren op openbare plaatsen"]
[null,"Obstakel / overig = obstakels of overige voertuigen"]
[null,"          geparkeerd op openbare plaatsen"]
[null,"Fout pers = personenwagens die fout geparkeerd staan"]
[null,"Fout vracht = vrachtwagens die fout geparkeerd staan"]
[null,"E-wagen = geparkeerde elektrisch voertuig bij een"]
[null,"          elektrisch oplaadpunt"]
[null,"Invalide = personenwagens en motoren op voor"]
[null,"          invalide personen bestemde parkeerplaats"]
[null,"Gestalde fietsen = alle gestalde fietsen op de"]
[null,"          daarvoor bestemde parkeerplaatsen"]

{"sheet":"58.Oudenburg","index":55,"n_rows":57,"n_cols":26,"rows_kept":57,"cut":false,"hidden":false,"merged":[[4,3,5,12],[4,16,5,16],[15,3,16,12]]}
[]
[null,"PARKEERONDERZOEK",null,"CARPOOLPARKINGS EN P+R PARKINGS"]
[null,58,null,{"$f":"B8 & \" - \"& TEXT(VLOOKUP(B3,Coordinaten!$A$2:$G$95,7,0),\"dddd dd mmmm jjjj\")","v":"Carpool parking Oudenburg, Oudenburg - dinsdag 09 november 2021"}]
[null,{"$f":"VLOOKUP(B3,Coordinaten!$A$2:$G$95,6,0)","v":"51.200906, 3.007635"}]
[null,null,null,"BEZETTING  ",null,null,null,null,null,null,null,null,null,null,null,null,"OPMERKINGEN"]
[]
[null,"Onderzoeksgebied",null,"Datum","Geregistreerd tussen","Pers","Vracht","Motor","Obstakel / overig","Fout   pers","Fout Vracht","Totaal","E-wagen\nplaats","Invalidenplaats","Gestalde fietsen",null,null,null,null,null,{"$f":"F7","v":"Pers"},"Vracht","Motor","Obstakel / overig","Fout   pers","Fout Vracht"]
[null,{"$f":"VLOOKUP(B3,Coordinaten!$A$2:$G$95,3,0)&\", \"&VLOOKUP(B3,Coordinaten!$A$2:$G$95,5,0)","v":"Carpool parking Oudenburg, Oudenburg"},null,"2021-11-09","09:00 - 16:00u",3,0,0,2,0,0,5,0,0,0,null,"Obstakel 2 aanhangers",null,{"$f":"D8","v":"2021-11-09"},{"$f":"E8","v":"09:00 - 16:00u"},{"$f":"IF(F8=0,NA(),F8/$L8)","v":0.6},{"$f":"IF(G8=0,NA(),G8/$L8)","v":{"$error":"#N/A"}},{"$f":"IF(H8=0,NA(),H8/$L8)","v":{"$error":"#N/A"}},0.4,{"$error":"#N/A"},{"$error":"#N/A"}]
[null,{"$f":"\"Nabij kruispunt: \"&VLOOKUP(B3,Coordinaten!$A$2:$L$95,4,0)","v":"Nabij kruispunt: N358 / A10"},null,null,null,0.6,"-","-",0.4,"-","-",1,null,null,null,null,0,null,{"$f":"D10","v":"2021-11-09"},{"$f":"E10","v":"19:00 - 02:00u"},{"$f":"IF(F10=0,NA(),F10/$L10)","v":1},{"$f":"IF(G10=0,NA(),G10/$L10)","v":{"$error":"#N/A"}},{"$error":"#N/A"},{"$error":"#N/A"},{"$error":"#N/A"},{"$error":"#N/A"}]
[null,null,null,"2021-11-09","19:00 - 02:00u",2,0,0,0,0,0,2,0,0,0,null,0]
[null,"Meting",null,null,null,1,"-","-","-","-","-",1,null,null,null,null,0]
[null,{"$f":"\"Meetperiode: \"&TEXT(VLOOKUP(B3,Coordinaten!$A$2:$G$95,7,0),\"dddd dd mmmm jjjj\")","v":"Meetperiode: dinsdag 09 november 2021"}]
[null,"Methodiek: Parkeerdrukmeting met waarnemers"]
[null,"In opdracht van: Vlaamse overheid"]
[null,"Uitgevoerd door: Dufec"]
[null,null,null,"VERDELING NAAR CATEGORIE"]
[null,"Locatie"]
[null,{"$f":"IF(B4=\"\",\"\",HYPERLINK(\"http://www.googlemaps.com/?q=\"&B4,\"Lat/Long: \"&B4))","v":"Lat/Long: 51.200906, 3.007635"}]
[]
[null,null,null,null,null,null,null,null,null,null,null,null,null,null,null,"Legenda"]
[null,null,null,null,null,null,null,null,null,null,null,null,null,null,null,null,"Personenwagen"]
[null,null,null,null,null,null,null,null,null,null,null,null,null,null,null,null,"Vracht"]
[null,null,null,null,null,null,null,null,null,null,null,null,null,null,null,null,"Motor"]
[null,null,null,null,null,null,null,null,null,null,null,null,null,null,null,null,"Obstakel / overig"]
[null,null,null,null,null,null,null,null,null,null,null,null,null,null,null,null,"Fout personenwagen"]
[null,null,null,null,null,null,null,null,null,null,null,null,null,null,null,null,"Fout Vracht"]
[]
[]
[]
[]
[]
[]
[]
[]
[]
[]
[]
[null,"Opmerking"]
[null,"Het onderzoek vindt plaats gedurende coronamaatregelen."]
[null,"Dit heeft mogelijk een effect op de resultaten."]
[]
[null,"Toelichting"]
[null,"Pers = personenwagens op daarvoor bestemde"]
[null,"          openbare plaatsen"]
[null,"Vracht = vrachtwagens op daarvoor bestemde"]
[null,"          parkeerplaatsen (middel- en zwaar vrachtverkeer)"]
[null,"Motor = geparkeerde motoren op openbare plaatsen"]
[null,"Obstakel / overig = obstakels of overige voertuigen"]
[null,"          geparkeerd op openbare plaatsen"]
[null,"Fout pers = personenwagens die fout geparkeerd staan"]
[null,"Fout vracht = vrachtwagens die fout geparkeerd staan"]
[null,"E-wagen = geparkeerde elektrisch voertuig bij een"]
[null,"          elektrisch oplaadpunt"]
[null,"Invalide = personenwagens en motoren op voor"]
[null,"          invalide personen bestemde parkeerplaats"]
[null,"Gestalde fietsen = alle gestalde fietsen op de"]
[null,"          daarvoor bestemde parkeerplaatsen"]

{"sheet":"59.Middelkerke","index":56,"n_rows":57,"n_cols":26,"rows_kept":57,"cut":false,"hidden":false,"merged":[[4,3,5,12],[4,16,5,16],[15,3,16,12]]}
[]
[null,"PARKEERONDERZOEK",null,"CARPOOLPARKINGS EN P+R PARKINGS"]
[null,59,null,{"$f":"B8 & \" - \"& TEXT(VLOOKUP(B3,Coordinaten!$A$2:$G$95,7,0),\"dddd dd mmmm jjjj\")","v":"Carpool parking Middelkerke, Middelkerke - dinsdag 09 november 2021"}]
[null,{"$f":"VLOOKUP(B3,Coordinaten!$A$2:$G$95,6,0)","v":"51.139750, 2.862593"}]
[null,null,null,"BEZETTING  ",null,null,null,null,null,null,null,null,null,null,null,null,"OPMERKINGEN"]
[]
[null,"Onderzoeksgebied",null,"Datum","Geregistreerd tussen","Pers","Vracht","Motor","Obstakel / overig","Fout   pers","Fout Vracht","Totaal","E-wagen\nplaats","Invalidenplaats","Gestalde fietsen",null,null,null,null,null,{"$f":"F7","v":"Pers"},"Vracht","Motor","Obstakel / overig","Fout   pers","Fout Vracht"]
[null,{"$f":"VLOOKUP(B3,Coordinaten!$A$2:$G$95,3,0)&\", \"&VLOOKUP(B3,Coordinaten!$A$2:$G$95,5,0)","v":"Carpool parking Middelkerke, Middelkerke"},null,"2021-11-09","09:00 - 16:00u",9,0,1,1,0,0,11,0,0,1,null,"Obstakel: aanhanger",null,{"$f":"D8","v":"2021-11-09"},{"$f":"E8","v":"09:00 - 16:00u"},{"$f":"IF(F8=0,NA(),F8/$L8)","v":0.81818181818181823},{"$f":"IF(G8=0,NA(),G8/$L8)","v":{"$error":"#N/A"}},{"$f":"IF(H8=0,NA(),H8/$L8)","v":9.0909090909090912E-2},9.0909090909090912E-2,{"$error":"#N/A"},{"$error":"#N/A"}]
[null,{"$f":"\"Nabij kruispunt: \"&VLOOKUP(B3,Coordinaten!$A$2:$L$95,4,0)","v":"Nabij kruispunt: N369 / A18"},null,null,null,0.81818181818181823,"-",9.0909090909090912E-2,9.0909090909090912E-2,"-","-",1,null,null,null,null,0,null,{"$f":"D10","v":"2021-11-09"},{"$f":"E10","v":"19:00 - 02:00u"},{"$f":"IF(F10=0,NA(),F10/$L10)","v":{"$error":"#N/A"}},{"$f":"IF(G10=0,NA(),G10/$L10)","v":{"$error":"#N/A"}},{"$error":"#N/A"},{"$error":"#N/A"},{"$error":"#N/A"},{"$error":"#N/A"}]
[null,null,null,"2021-11-09","19:00 - 02:00u",0,0,0,0,0,0,0,0,0,0,null,"Geen bezetting"]
[null,"Meting",null,null,null,"-","-","-","-","-","-","-",null,null,null,null,0]
[null,{"$f":"\"Meetperiode: \"&TEXT(VLOOKUP(B3,Coordinaten!$A$2:$G$95,7,0),\"dddd dd mmmm jjjj\")","v":"Meetperiode: dinsdag 09 november 2021"}]
[null,"Methodiek: Parkeerdrukmeting met waarnemers"]
[null,"In opdracht van: Vlaamse overheid"]
[null,"Uitgevoerd door: Dufec"]
[null,null,null,"VERDELING NAAR CATEGORIE"]
[null,"Locatie"]
[null,{"$f":"IF(B4=\"\",\"\",HYPERLINK(\"http://www.googlemaps.com/?q=\"&B4,\"Lat/Long: \"&B4))","v":"Lat/Long: 51.139750, 2.862593"}]
[]
[null,null,null,null,null,null,null,null,null,null,null,null,null,null,null,"Legenda"]
[null,null,null,null,null,null,null,null,null,null,null,null,null,null,null,null,"Personenwagen"]
[null,null,null,null,null,null,null,null,null,null,null,null,null,null,null,null,"Vracht"]
[null,null,null,null,null,null,null,null,null,null,null,null,null,null,null,null,"Motor"]
[null,null,null,null,null,null,null,null,null,null,null,null,null,null,null,null,"Obstakel / overig"]
[null,null,null,null,null,null,null,null,null,null,null,null,null,null,null,null,"Fout personenwagen"]
[null,null,null,null,null,null,null,null,null,null,null,null,null,null,null,null,"Fout Vracht"]
[]
[]
[]
[]
[]
[]
[]
[]
[]
[]
[]
[null,"Opmerking"]
[null,"Het onderzoek vindt plaats gedurende coronamaatregelen."]
[null,"Dit heeft mogelijk een effect op de resultaten."]
[]
[null,"Toelichting"]
[null,"Pers = personenwagens op daarvoor bestemde"]
[null,"          openbare plaatsen"]
[null,"Vracht = vrachtwagens op daarvoor bestemde"]
[null,"          parkeerplaatsen (middel- en zwaar vrachtverkeer)"]
[null,"Motor = geparkeerde motoren op openbare plaatsen"]
[null,"Obstakel / overig = obstakels of overige voertuigen"]
[null,"          geparkeerd op openbare plaatsen"]
[null,"Fout pers = personenwagens die fout geparkeerd staan"]
[null,"Fout vracht = vrachtwagens die fout geparkeerd staan"]
[null,"E-wagen = geparkeerde elektrisch voertuig bij een"]
[null,"          elektrisch oplaadpunt"]
[null,"Invalide = personenwagens en motoren op voor"]
[null,"          invalide personen bestemde parkeerplaats"]
[null,"Gestalde fietsen = alle gestalde fietsen op de"]
[null,"          daarvoor bestemde parkeerplaatsen"]

{"sheet":"60.Loenhout","index":57,"n_rows":57,"n_cols":26,"rows_kept":57,"cut":false,"hidden":false,"merged":[[4,3,5,12],[4,16,5,16],[15,3,16,12]]}
[]
[null,"PARKEERONDERZOEK",null,"CARPOOLPARKINGS EN P+R PARKINGS"]
[null,60,null,{"$f":"B8 & \" - \"& TEXT(VLOOKUP(B3,Coordinaten!$A$2:$G$95,7,0),\"dddd dd mmmm jjjj\")","v":"P+R parking Loenhout, Wuustwezel - dinsdag 09 november 2021"}]
[null,{"$f":"VLOOKUP(B3,Coordinaten!$A$2:$G$95,6,0)","v":"51.397419, 4.689008"}]
[null,null,null,"BEZETTING  ",null,null,null,null,null,null,null,null,null,null,null,null,"OPMERKINGEN"]
[]
[null,"Onderzoeksgebied",null,"Datum","Geregistreerd tussen","Pers","Vracht","Motor","Obstakel / overig","Fout   pers","Fout Vracht","Totaal","E-wagen\nplaats","Invalidenplaats","Gestalde fietsen",null,null,null,null,null,{"$f":"F7","v":"Pers"},"Vracht","Motor","Obstakel / overig","Fout   pers","Fout Vracht"]
[null,{"$f":"VLOOKUP(B3,Coordinaten!$A$2:$G$95,3,0)&\", \"&VLOOKUP(B3,Coordinaten!$A$2:$G$95,5,0)","v":"P+R parking Loenhout, Wuustwezel"},null,"2021-11-09","09:00 - 16:00u",23,0,0,0,0,0,23,0,0,0,null,0,null,{"$f":"D8","v":"2021-11-09"},{"$f":"E8","v":"09:00 - 16:00u"},{"$f":"IF(F8=0,NA(),F8/$L8)","v":1},{"$f":"IF(G8=0,NA(),G8/$L8)","v":{"$error":"#N/A"}},{"$f":"IF(H8=0,NA(),H8/$L8)","v":{"$error":"#N/A"}},{"$error":"#N/A"},{"$error":"#N/A"},{"$error":"#N/A"}]
[null,{"$f":"\"Nabij kruispunt: \"&VLOOKUP(B3,Coordinaten!$A$2:$L$95,4,0)","v":"Nabij kruispunt: N144 / Hollandseweg"},null,null,null,1,"-","-","-","-","-",1,null,null,null,null,0,null,{"$f":"D10","v":"2021-11-09"},{"$f":"E10","v":"19:00 - 02:00u"},{"$f":"IF(F10=0,NA(),F10/$L10)","v":0.42857142857142855},{"$f":"IF(G10=0,NA(),G10/$L10)","v":{"$error":"#N/A"}},{"$error":"#N/A"},{"$error":"#N/A"},{"$error":"#N/A"},0.5714285714285714]
[null,null,null,"2021-11-09","19:00 - 02:00u",6,0,0,0,0,8,14,0,0,0,null,0]
[null,"Meting",null,null,null,0.42857142857142855,"-","-","-","-",0.5714285714285714,1,null,null,null,null,0]
[null,{"$f":"\"Meetperiode: \"&TEXT(VLOOKUP(B3,Coordinaten!$A$2:$G$95,7,0),\"dddd dd mmmm jjjj\")","v":"Meetperiode: dinsdag 09 november 2021"}]
[null,"Methodiek: Parkeerdrukmeting met waarnemers"]
[null,"In opdracht van: Vlaamse overheid"]
[null,"Uitgevoerd door: Dufec"]
[null,null,null,"VERDELING NAAR CATEGORIE"]
[null,"Locatie"]
[null,{"$f":"IF(B4=\"\",\"\",HYPERLINK(\"http://www.googlemaps.com/?q=\"&B4,\"Lat/Long: \"&B4))","v":"Lat/Long: 51.397419, 4.689008"}]
[]
[null,null,null,null,null,null,null,null,null,null,null,null,null,null,null,"Legenda"]
[null,null,null,null,null,null,null,null,null,null,null,null,null,null,null,null,"Personenwagen"]
[null,null,null,null,null,null,null,null,null,null,null,null,null,null,null,null,"Vracht"]
[null,null,null,null,null,null,null,null,null,null,null,null,null,null,null,null,"Motor"]
[null,null,null,null,null,null,null,null,null,null,null,null,null,null,null,null,"Obstakel / overig"]
[null,null,null,null,null,null,null,null,null,null,null,null,null,null,null,null,"Fout personenwagen"]
[null,null,null,null,null,null,null,null,null,null,null,null,null,null,null,null,"Fout Vracht"]
[]
[]
[]
[]
[]
[]
[]
[]
[]
[]
[]
[null,"Opmerking"]
[null,"Het onderzoek vindt plaats gedurende coronamaatregelen."]
[null,"Dit heeft mogelijk een effect op de resultaten."]
[]
[null,"Toelichting"]
[null,"Pers = personenwagens op daarvoor bestemde"]
[null,"          openbare plaatsen"]
[null,"Vracht = vrachtwagens op daarvoor bestemde"]
[null,"          parkeerplaatsen (middel- en zwaar vrachtverkeer)"]
[null,"Motor = geparkeerde motoren op openbare plaatsen"]
[null,"Obstakel / overig = obstakels of overige voertuigen"]
[null,"          geparkeerd op openbare plaatsen"]
[null,"Fout pers = personenwagens die fout geparkeerd staan"]
[null,"Fout vracht = vrachtwagens die fout geparkeerd staan"]
[null,"E-wagen = geparkeerde elektrisch voertuig bij een"]
[null,"          elektrisch oplaadpunt"]
[null,"Invalide = personenwagens en motoren op voor"]
[null,"          invalide personen bestemde parkeerplaats"]
[null,"Gestalde fietsen = alle gestalde fietsen op de"]
[null,"          daarvoor bestemde parkeerplaatsen"]

{"sheet":"61.Meise","index":58,"n_rows":57,"n_cols":26,"rows_kept":57,"cut":false,"hidden":false,"merged":[[4,3,5,12],[4,16,5,16],[15,3,16,12]]}
[]
[null,"PARKEERONDERZOEK",null,"CARPOOLPARKINGS EN P+R PARKINGS"]
[null,61,null,{"$f":"B8 & \" - \"& TEXT(VLOOKUP(B3,Coordinaten!$A$2:$G$95,7,0),\"dddd dd mmmm jjjj\")","v":"P+R parking Meise, Meise - donderdag 18 november 2021"}]
[null,{"$f":"VLOOKUP(B3,Coordinaten!$A$2:$G$95,6,0)","v":"50.934686, 4.330993"}]
[null,null,null,"BEZETTING  ",null,null,null,null,null,null,null,null,null,null,null,null,"OPMERKINGEN"]
[]
[null,"Onderzoeksgebied",null,"Datum","Geregistreerd tussen","Pers","Vracht","Motor","Obstakel / overig","Fout   pers","Fout Vracht","Totaal","E-wagen\nplaats","Invalidenplaats","Gestalde fietsen",null,null,null,null,null,{"$f":"F7","v":"Pers"},"Vracht","Motor","Obstakel / overig","Fout   pers","Fout Vracht"]
[null,{"$f":"VLOOKUP(B3,Coordinaten!$A$2:$G$95,3,0)&\", \"&VLOOKUP(B3,Coordinaten!$A$2:$G$95,5,0)","v":"P+R parking Meise, Meise"},null,"2021-11-18","09:00 - 16:00u",31,5,0,1,1,4,42,0,0,0,null,"Obstakel: aanhanger",null,{"$f":"D8","v":"2021-11-18"},{"$f":"E8","v":"09:00 - 16:00u"},{"$f":"IF(F8=0,NA(),F8/$L8)","v":0.73809523809523814},{"$f":"IF(G8=0,NA(),G8/$L8)","v":0.11904761904761904},{"$f":"IF(H8=0,NA(),H8/$L8)","v":{"$error":"#N/A"}},2.3809523809523808E-2,2.3809523809523808E-2,9.5238095238095233E-2]
[null,{"$f":"\"Nabij kruispunt: \"&VLOOKUP(B3,Coordinaten!$A$2:$L$95,4,0)","v":"Nabij kruispunt: N227 / A12"},null,null,null,0.73809523809523814,0.11904761904761904,"-",2.3809523809523808E-2,2.3809523809523808E-2,9.5238095238095233E-2,1,null,null,null,null,0,null,{"$f":"D10","v":"2021-11-18"},{"$f":"E10","v":"19:00 - 02:00u"},{"$f":"IF(F10=0,NA(),F10/$L10)","v":0.48571428571428571},{"$f":"IF(G10=0,NA(),G10/$L10)","v":0.2},{"$error":"#N/A"},{"$error":"#N/A"},{"$error":"#N/A"},0.31428571428571428]
[null,null,null,"2021-11-18","19:00 - 02:00u",17,7,0,0,0,11,35,0,0,0,null,0]
[null,"Meting",null,null,null,0.48571428571428571,0.2,"-","-","-",0.31428571428571428,1,null,null,null,null,0]
[null,{"$f":"\"Meetperiode: \"&TEXT(VLOOKUP(B3,Coordinaten!$A$2:$G$95,7,0),\"dddd dd mmmm jjjj\")","v":"Meetperiode: donderdag 18 november 2021"}]
[null,"Methodiek: Parkeerdrukmeting met waarnemers"]
[null,"In opdracht van: Vlaamse overheid"]
[null,"Uitgevoerd door: Dufec"]
[null,null,null,"VERDELING NAAR CATEGORIE"]
[null,"Locatie"]
[null,{"$f":"IF(B4=\"\",\"\",HYPERLINK(\"http://www.googlemaps.com/?q=\"&B4,\"Lat/Long: \"&B4))","v":"Lat/Long: 50.934686, 4.330993"}]
[]
[null,null,null,null,null,null,null,null,null,null,null,null,null,null,null,"Legenda"]
[null,null,null,null,null,null,null,null,null,null,null,null,null,null,null,null,"Personenwagen"]
[null,null,null,null,null,null,null,null,null,null,null,null,null,null,null,null,"Vracht"]
[null,null,null,null,null,null,null,null,null,null,null,null,null,null,null,null,"Motor"]
[null,null,null,null,null,null,null,null,null,null,null,null,null,null,null,null,"Obstakel / overig"]
[null,null,null,null,null,null,null,null,null,null,null,null,null,null,null,null,"Fout personenwagen"]
[null,null,null,null,null,null,null,null,null,null,null,null,null,null,null,null,"Fout Vracht"]
[]
[]
[]
[]
[]
[]
[]
[]
[]
[]
[]
[null,"Opmerking"]
[null,"Het onderzoek vindt plaats gedurende coronamaatregelen."]
[null,"Dit heeft mogelijk een effect op de resultaten."]
[]
[null,"Toelichting"]
[null,"Pers = personenwagens op daarvoor bestemde"]
[null,"          openbare plaatsen"]
[null,"Vracht = vrachtwagens op daarvoor bestemde"]
[null,"          parkeerplaatsen (middel- en zwaar vrachtverkeer)"]
[null,"Motor = geparkeerde motoren op openbare plaatsen"]
[null,"Obstakel / overig = obstakels of overige voertuigen"]
[null,"          geparkeerd op openbare plaatsen"]
[null,"Fout pers = personenwagens die fout geparkeerd staan"]
[null,"Fout vracht = vrachtwagens die fout geparkeerd staan"]
[null,"E-wagen = geparkeerde elektrisch voertuig bij een"]
[null,"          elektrisch oplaadpunt"]
[null,"Invalide = personenwagens en motoren op voor"]
[null,"          invalide personen bestemde parkeerplaats"]
[null,"Gestalde fietsen = alle gestalde fietsen op de"]
[null,"          daarvoor bestemde parkeerplaatsen"]

{"sheet":"62.Nieuwpoort","index":59,"n_rows":57,"n_cols":26,"rows_kept":57,"cut":false,"hidden":false,"merged":[[4,3,5,12],[4,16,5,16],[15,3,16,12]]}
[]
[null,"PARKEERONDERZOEK",null,"CARPOOLPARKINGS EN P+R PARKINGS"]
[null,62,null,{"$f":"B8 & \" - \"& TEXT(VLOOKUP(B3,Coordinaten!$A$2:$G$95,7,0),\"dddd dd mmmm jjjj\")","v":"Carpool parking Nieuwpoort, Nieuwpoort - dinsdag 09 november 2021"}]
[null,{"$f":"VLOOKUP(B3,Coordinaten!$A$2:$G$95,6,0)","v":"51.109593, 2.757978"}]
[null,null,null,"BEZETTING  ",null,null,null,null,null,null,null,null,null,null,null,null,"OPMERKINGEN"]
[]
[null,"Onderzoeksgebied",null,"Datum","Geregistreerd tussen","Pers","Vracht","Motor","Obstakel / overig","Fout   pers","Fout Vracht","Totaal","E-wagen\nplaats","Invalidenplaats","Gestalde fietsen",null,null,null,null,null,{"$f":"F7","v":"Pers"},"Vracht","Motor","Obstakel / overig","Fout   pers","Fout Vracht"]
[null,{"$f":"VLOOKUP(B3,Coordinaten!$A$2:$G$95,3,0)&\", \"&VLOOKUP(B3,Coordinaten!$A$2:$G$95,5,0)","v":"Carpool parking Nieuwpoort, Nieuwpoort"},null,"2021-11-09","09:00 - 16:00u",14,0,0,2,2,0,18,0,0,0,null,"Obstakel: glasbakken en kledingcontainer",null,{"$f":"D8","v":"2021-11-09"},{"$f":"E8","v":"09:00 - 16:00u"},{"$f":"IF(F8=0,NA(),F8/$L8)","v":0.77777777777777779},{"$f":"IF(G8=0,NA(),G8/$L8)","v":{"$error":"#N/A"}},{"$f":"IF(H8=0,NA(),H8/$L8)","v":{"$error":"#N/A"}},0.1111111111111111,0.1111111111111111,{"$error":"#N/A"}]
[null,{"$f":"\"Nabij kruispunt: \"&VLOOKUP(B3,Coordinaten!$A$2:$L$95,4,0)","v":"Nabij kruispunt: N355 / A18"},null,null,null,0.77777777777777779,"-","-",0.1111111111111111,0.1111111111111111,"-",1,null,null,null,null,0,null,{"$f":"D10","v":"2021-11-09"},{"$f":"E10","v":"19:00 - 02:00u"},{"$f":"IF(F10=0,NA(),F10/$L10)","v":0.14285714285714285},{"$f":"IF(G10=0,NA(),G10/$L10)","v":0.42857142857142855},{"$error":"#N/A"},{"$error":"#N/A"},{"$error":"#N/A"},0.42857142857142855]
[null,null,null,"2021-11-09","19:00 - 02:00u",1,3,0,0,0,3,7,0,1,0,null,0]
[null,"Meting",null,null,null,0.14285714285714285,0.42857142857142855,"-","-","-",0.42857142857142855,1,null,null,null,null,0]
[null,{"$f":"\"Meetperiode: \"&TEXT(VLOOKUP(B3,Coordinaten!$A$2:$G$95,7,0),\"dddd dd mmmm jjjj\")","v":"Meetperiode: dinsdag 09 november 2021"}]
[null,"Methodiek: Parkeerdrukmeting met waarnemers"]
[null,"In opdracht van: Vlaamse overheid"]
[null,"Uitgevoerd door: Dufec"]
[null,null,null,"VERDELING NAAR CATEGORIE"]
[null,"Locatie"]
[null,{"$f":"IF(B4=\"\",\"\",HYPERLINK(\"http://www.googlemaps.com/?q=\"&B4,\"Lat/Long: \"&B4))","v":"Lat/Long: 51.109593, 2.757978"}]
[]
[null,null,null,null,null,null,null,null,null,null,null,null,null,null,null,"Legenda"]
[null,null,null,null,null,null,null,null,null,null,null,null,null,null,null,null,"Personenwagen"]
[null,null,null,null,null,null,null,null,null,null,null,null,null,null,null,null,"Vracht"]
[null,null,null,null,null,null,null,null,null,null,null,null,null,null,null,null,"Motor"]
[null,null,null,null,null,null,null,null,null,null,null,null,null,null,null,null,"Obstakel / overig"]
[null,null,null,null,null,null,null,null,null,null,null,null,null,null,null,null,"Fout personenwagen"]
[null,null,null,null,null,null,null,null,null,null,null,null,null,null,null,null,"Fout Vracht"]
[]
[]
[]
[]
[]
[]
[]
[]
[]
[]
[]
[null,"Opmerking"]
[null,"Het onderzoek vindt plaats gedurende coronamaatregelen."]
[null,"Dit heeft mogelijk een effect op de resultaten."]
[]
[null,"Toelichting"]
[null,"Pers = personenwagens op daarvoor bestemde"]
[null,"          openbare plaatsen"]
[null,"Vracht = vrachtwagens op daarvoor bestemde"]
[null,"          parkeerplaatsen (middel- en zwaar vrachtverkeer)"]
[null,"Motor = geparkeerde motoren op openbare plaatsen"]
[null,"Obstakel / overig = obstakels of overige voertuigen"]
[null,"          geparkeerd op openbare plaatsen"]
[null,"Fout pers = personenwagens die fout geparkeerd staan"]
[null,"Fout vracht = vrachtwagens die fout geparkeerd staan"]
[null,"E-wagen = geparkeerde elektrisch voertuig bij een"]
[null,"          elektrisch oplaadpunt"]
[null,"Invalide = personenwagens en motoren op voor"]
[null,"          invalide personen bestemde parkeerplaats"]
[null,"Gestalde fietsen = alle gestalde fietsen op de"]
[null,"          daarvoor bestemde parkeerplaatsen"]

{"sheet":"63.Lichtervelde","index":60,"n_rows":57,"n_cols":26,"rows_kept":57,"cut":false,"hidden":false,"merged":[[4,3,5,12],[4,16,5,16],[15,3,16,12]]}
[]
[null,"PARKEERONDERZOEK",null,"CARPOOLPARKINGS EN P+R PARKINGS"]
[null,63,null,{"$f":"B8 & \" - \"& TEXT(VLOOKUP(B3,Coordinaten!$A$2:$G$95,7,0),\"dddd dd mmmm jjjj\")","v":"Carpool parking Lichtervelde, Lichtervelde - dinsdag 23 november 2021"}]
[null,{"$f":"VLOOKUP(B3,Coordinaten!$A$2:$G$95,6,0)","v":"51.011285, 3.167382"}]
[null,null,null,"BEZETTING  ",null,null,null,null,null,null,null,null,null,null,null,null,"OPMERKINGEN"]
[]
[null,"Onderzoeksgebied",null,"Datum","Geregistreerd tussen","Pers","Vracht","Motor","Obstakel / overig","Fout   pers","Fout Vracht","Totaal","E-wagen\nplaats","Invalidenplaats","Gestalde fietsen",null,null,null,null,null,{"$f":"F7","v":"Pers"},"Vracht","Motor","Obstakel / overig","Fout   pers","Fout Vracht"]
[null,{"$f":"VLOOKUP(B3,Coordinaten!$A$2:$G$95,3,0)&\", \"&VLOOKUP(B3,Coordinaten!$A$2:$G$95,5,0)","v":"Carpool parking Lichtervelde, Lichtervelde"},null,"2021-11-23","09:00 - 16:00u",28,1,0,0,0,0,29,0,0,4,null,"Vanaf 20 november nieuwe coronamaatregelen, waaronder verplicht telewerk",null,{"$f":"D8","v":"2021-11-23"},{"$f":"E8","v":"09:00 - 16:00u"},{"$f":"IF(F8=0,NA(),F8/$L8)","v":0.96551724137931039},{"$f":"IF(G8=0,NA(),G8/$L8)","v":3.4482758620689655E-2},{"$f":"IF(H8=0,NA(),H8/$L8)","v":{"$error":"#N/A"}},{"$error":"#N/A"},{"$error":"#N/A"},{"$error":"#N/A"}]
[null,{"$f":"\"Nabij kruispunt: \"&VLOOKUP(B3,Coordinaten!$A$2:$L$95,4,0)","v":"Nabij kruispunt: N35 / A17"},null,null,null,0.96551724137931039,3.4482758620689655E-2,"-","-","-","-",1,null,null,null,null,0,null,{"$f":"D10","v":"2021-11-23"},{"$f":"E10","v":"19:00 - 02:00u"},{"$f":"IF(F10=0,NA(),F10/$L10)","v":0.5},{"$f":"IF(G10=0,NA(),G10/$L10)","v":0.25},{"$error":"#N/A"},{"$error":"#N/A"},{"$error":"#N/A"},0.25]
[null,null,null,"2021-11-23","19:00 - 02:00u",4,2,0,0,0,2,8,0,0,0,null,"Vanaf 20 november nieuwe coronamaatregelen, waaronder verplicht telewerk"]
[null,"Meting",null,null,null,0.5,0.25,"-","-","-",0.25,1,null,null,null,null,0]
[null,{"$f":"\"Meetperiode: \"&TEXT(VLOOKUP(B3,Coordinaten!$A$2:$G$95,7,0),\"dddd dd mmmm jjjj\")","v":"Meetperiode: dinsdag 23 november 2021"}]
[null,"Methodiek: Parkeerdrukmeting met waarnemers"]
[null,"In opdracht van: Vlaamse overheid"]
[null,"Uitgevoerd door: Dufec"]
[null,null,null,"VERDELING NAAR CATEGORIE"]
[null,"Locatie"]
[null,{"$f":"IF(B4=\"\",\"\",HYPERLINK(\"http://www.googlemaps.com/?q=\"&B4,\"Lat/Long: \"&B4))","v":"Lat/Long: 51.011285, 3.167382"}]
[]
[null,null,null,null,null,null,null,null,null,null,null,null,null,null,null,"Legenda"]
[null,null,null,null,null,null,null,null,null,null,null,null,null,null,null,null,"Personenwagen"]
[null,null,null,null,null,null,null,null,null,null,null,null,null,null,null,null,"Vracht"]
[null,null,null,null,null,null,null,null,null,null,null,null,null,null,null,null,"Motor"]
[null,null,null,null,null,null,null,null,null,null,null,null,null,null,null,null,"Obstakel / overig"]
[null,null,null,null,null,null,null,null,null,null,null,null,null,null,null,null,"Fout personenwagen"]
[null,null,null,null,null,null,null,null,null,null,null,null,null,null,null,null,"Fout Vracht"]
[]
[]
[]
[]
[]
[]
[]
[]
[]
[]
[]
[null,"Opmerking"]
[null,"Het onderzoek vindt plaats gedurende coronamaatregelen."]
[null,"Dit heeft mogelijk een effect op de resultaten."]
[]
[null,"Toelichting"]
[null,"Pers = personenwagens op daarvoor bestemde"]
[null,"          openbare plaatsen"]
[null,"Vracht = vrachtwagens op daarvoor bestemde"]
[null,"          parkeerplaatsen (middel- en zwaar vrachtverkeer)"]
[null,"Motor = geparkeerde motoren op openbare plaatsen"]
[null,"Obstakel / overig = obstakels of overige voertuigen"]
[null,"          geparkeerd op openbare plaatsen"]
[null,"Fout pers = personenwagens die fout geparkeerd staan"]
[null,"Fout vracht = vrachtwagens die fout geparkeerd staan"]
[null,"E-wagen = geparkeerde elektrisch voertuig bij een"]
[null,"          elektrisch oplaadpunt"]
[null,"Invalide = personenwagens en motoren op voor"]
[null,"          invalide personen bestemde parkeerplaats"]
[null,"Gestalde fietsen = alle gestalde fietsen op de"]
[null,"          daarvoor bestemde parkeerplaatsen"]

{"sheet":"64.Kortrijk-Oost","index":61,"n_rows":57,"n_cols":26,"rows_kept":57,"cut":false,"hidden":false,"merged":[[4,3,5,12],[4,16,5,16],[15,3,16,12]]}
[]
[null,"PARKEERONDERZOEK",null,"CARPOOLPARKINGS EN P+R PARKINGS"]
[null,64,null,{"$f":"B8 & \" - \"& TEXT(VLOOKUP(B3,Coordinaten!$A$2:$G$95,7,0),\"dddd dd mmmm jjjj\")","v":"Carpool parking Kortrijk-Oost, Kortrijk - dinsdag 23 november 2021"}]
[null,{"$f":"VLOOKUP(B3,Coordinaten!$A$2:$G$95,6,0)","v":"50.817455, 3.299312"}]
[null,null,null,"BEZETTING  ",null,null,null,null,null,null,null,null,null,null,null,null,"OPMERKINGEN"]
[]
[null,"Onderzoeksgebied",null,"Datum","Geregistreerd tussen","Pers","Vracht","Motor","Obstakel / overig","Fout   pers","Fout Vracht","Totaal","E-wagen\nplaats","Invalidenplaats","Gestalde fietsen",null,null,null,null,null,{"$f":"F7","v":"Pers"},"Vracht","Motor","Obstakel / overig","Fout   pers","Fout Vracht"]
[null,{"$f":"VLOOKUP(B3,Coordinaten!$A$2:$G$95,3,0)&\", \"&VLOOKUP(B3,Coordinaten!$A$2:$G$95,5,0)","v":"Carpool parking Kortrijk-Oost, Kortrijk"},null,"2021-11-23","09:00 - 16:00u",60,0,0,0,0,0,60,0,0,8,null,"Vanaf 20 november nieuwe coronamaatregelen, waaronder verplicht telewerk",null,{"$f":"D8","v":"2021-11-23"},{"$f":"E8","v":"09:00 - 16:00u"},{"$f":"IF(F8=0,NA(),F8/$L8)","v":1},{"$f":"IF(G8=0,NA(),G8/$L8)","v":{"$error":"#N/A"}},{"$f":"IF(H8=0,NA(),H8/$L8)","v":{"$error":"#N/A"}},{"$error":"#N/A"},{"$error":"#N/A"},{"$error":"#N/A"}]
[null,{"$f":"\"Nabij kruispunt: \"&VLOOKUP(B3,Coordinaten!$A$2:$L$95,4,0)","v":"Nabij kruispunt: N8 / A14"},null,null,null,1,"-","-","-","-","-",1,null,null,null,null,0,null,{"$f":"D10","v":"2021-11-23"},{"$f":"E10","v":"19:00 - 02:00u"},{"$f":"IF(F10=0,NA(),F10/$L10)","v":1},{"$f":"IF(G10=0,NA(),G10/$L10)","v":{"$error":"#N/A"}},{"$error":"#N/A"},{"$error":"#N/A"},{"$error":"#N/A"},{"$error":"#N/A"}]
[null,null,null,"2021-11-23","19:00 - 02:00u",26,0,0,0,0,0,26,0,0,4,null,"Vanaf 20 november nieuwe coronamaatregelen, waaronder verplicht telewerk"]
[null,"Meting",null,null,null,1,"-","-","-","-","-",1,null,null,null,null,0]
[null,{"$f":"\"Meetperiode: \"&TEXT(VLOOKUP(B3,Coordinaten!$A$2:$G$95,7,0),\"dddd dd mmmm jjjj\")","v":"Meetperiode: dinsdag 23 november 2021"}]
[null,"Methodiek: Parkeerdrukmeting met waarnemers"]
[null,"In opdracht van: Vlaamse overheid"]
[null,"Uitgevoerd door: Dufec"]
[null,null,null,"VERDELING NAAR CATEGORIE"]
[null,"Locatie"]
[null,{"$f":"IF(B4=\"\",\"\",HYPERLINK(\"http://www.googlemaps.com/?q=\"&B4,\"Lat/Long: \"&B4))","v":"Lat/Long: 50.817455, 3.299312"}]
[]
[null,null,null,null,null,null,null,null,null,null,null,null,null,null,null,"Legenda"]
[null,null,null,null,null,null,null,null,null,null,null,null,null,null,null,null,"Personenwagen"]
[null,null,null,null,null,null,null,null,null,null,null,null,null,null,null,null,"Vracht"]
[null,null,null,null,null,null,null,null,null,null,null,null,null,null,null,null,"Motor"]
[null,null,null,null,null,null,null,null,null,null,null,null,null,null,null,null,"Obstakel / overig"]
[null,null,null,null,null,null,null,null,null,null,null,null,null,null,null,null,"Fout personenwagen"]
[null,null,null,null,null,null,null,null,null,null,null,null,null,null,null,null,"Fout Vracht"]
[]
[]
[]
[]
[]
[]
[]
[]
[]
[]
[]
[null,"Opmerking"]
[null,"Het onderzoek vindt plaats gedurende coronamaatregelen."]
[null,"Dit heeft mogelijk een effect op de resultaten."]
[]
[null,"Toelichting"]
[null,"Pers = personenwagens op daarvoor bestemde"]
[null,"          openbare plaatsen"]
[null,"Vracht = vrachtwagens op daarvoor bestemde"]
[null,"          parkeerplaatsen (middel- en zwaar vrachtverkeer)"]
[null,"Motor = geparkeerde motoren op openbare plaatsen"]
[null,"Obstakel / overig = obstakels of overige voertuigen"]
[null,"          geparkeerd op openbare plaatsen"]
[null,"Fout pers = personenwagens die fout geparkeerd staan"]
[null,"Fout vracht = vrachtwagens die fout geparkeerd staan"]
[null,"E-wagen = geparkeerde elektrisch voertuig bij een"]
[null,"          elektrisch oplaadpunt"]
[null,"Invalide = personenwagens en motoren op voor"]
[null,"          invalide personen bestemde parkeerplaats"]
[null,"Gestalde fietsen = alle gestalde fietsen op de"]
[null,"          daarvoor bestemde parkeerplaatsen"]

{"sheet":"65.Loppem","index":62,"n_rows":57,"n_cols":26,"rows_kept":57,"cut":false,"hidden":false,"merged":[[4,3,5,12],[4,16,5,16],[15,3,16,12]]}
[]
[null,"PARKEERONDERZOEK",null,"CARPOOLPARKINGS EN P+R PARKINGS"]
[null,65,null,{"$f":"B8 & \" - \"& TEXT(VLOOKUP(B3,Coordinaten!$A$2:$G$95,7,0),\"dddd dd mmmm jjjj\")","v":"P+R parking Loppem, Zedelgem - dinsdag 09 november 2021"}]
[null,{"$f":"VLOOKUP(B3,Coordinaten!$A$2:$G$95,6,0)","v":"51.162436, 3.192146"}]
[null,null,null,"BEZETTING  ",null,null,null,null,null,null,null,null,null,null,null,null,"OPMERKINGEN"]
[]
[null,"Onderzoeksgebied",null,"Datum","Geregistreerd tussen","Pers","Vracht","Motor","Obstakel / overig","Fout   pers","Fout Vracht","Totaal","E-wagen\nplaats","Invalidenplaats","Gestalde fietsen",null,null,null,null,null,{"$f":"F7","v":"Pers"},"Vracht","Motor","Obstakel / overig","Fout   pers","Fout Vracht"]
[null,{"$f":"VLOOKUP(B3,Coordinaten!$A$2:$G$95,3,0)&\", \"&VLOOKUP(B3,Coordinaten!$A$2:$G$95,5,0)","v":"P+R parking Loppem, Zedelgem"},null,"2021-11-09","09:00 - 16:00u",59,0,1,0,0,0,60,0,0,5,null,0,null,{"$f":"D8","v":"2021-11-09"},{"$f":"E8","v":"09:00 - 16:00u"},{"$f":"IF(F8=0,NA(),F8/$L8)","v":0.98333333333333328},{"$f":"IF(G8=0,NA(),G8/$L8)","v":{"$error":"#N/A"}},{"$f":"IF(H8=0,NA(),H8/$L8)","v":1.6666666666666666E-2},{"$error":"#N/A"},{"$error":"#N/A"},{"$error":"#N/A"}]
[null,{"$f":"\"Nabij kruispunt: \"&VLOOKUP(B3,Coordinaten!$A$2:$L$95,4,0)","v":"Nabij kruispunt: N397 / E40"},null,null,null,0.98333333333333328,"-",1.6666666666666666E-2,"-","-","-",1,null,null,null,null,0,null,{"$f":"D10","v":"2021-11-09"},{"$f":"E10","v":"19:00 - 02:00u"},{"$f":"IF(F10=0,NA(),F10/$L10)","v":1},{"$f":"IF(G10=0,NA(),G10/$L10)","v":{"$error":"#N/A"}},{"$error":"#N/A"},{"$error":"#N/A"},{"$error":"#N/A"},{"$error":"#N/A"}]
[null,null,null,"2021-11-09","19:00 - 02:00u",14,0,0,0,0,0,14,0,0,0,null,0]
[null,"Meting",null,null,null,1,"-","-","-","-","-",1,null,null,null,null,0]
[null,{"$f":"\"Meetperiode: \"&TEXT(VLOOKUP(B3,Coordinaten!$A$2:$G$95,7,0),\"dddd dd mmmm jjjj\")","v":"Meetperiode: dinsdag 09 november 2021"}]
[null,"Methodiek: Parkeerdrukmeting met waarnemers"]
[null,"In opdracht van: Vlaamse overheid"]
[null,"Uitgevoerd door: Dufec"]
[null,null,null,"VERDELING NAAR CATEGORIE"]
[null,"Locatie"]
[null,{"$f":"IF(B4=\"\",\"\",HYPERLINK(\"http://www.googlemaps.com/?q=\"&B4,\"Lat/Long: \"&B4))","v":"Lat/Long: 51.162436, 3.192146"}]
[]
[null,null,null,null,null,null,null,null,null,null,null,null,null,null,null,"Legenda"]
[null,null,null,null,null,null,null,null,null,null,null,null,null,null,null,null,"Personenwagen"]
[null,null,null,null,null,null,null,null,null,null,null,null,null,null,null,null,"Vracht"]
[null,null,null,null,null,null,null,null,null,null,null,null,null,null,null,null,"Motor"]
[null,null,null,null,null,null,null,null,null,null,null,null,null,null,null,null,"Obstakel / overig"]
[null,null,null,null,null,null,null,null,null,null,null,null,null,null,null,null,"Fout personenwagen"]
[null,null,null,null,null,null,null,null,null,null,null,null,null,null,null,null,"Fout Vracht"]
[]
[]
[]
[]
[]
[]
[]
[]
[]
[]
[]
[null,"Opmerking"]
[null,"Het onderzoek vindt plaats gedurende coronamaatregelen."]
[null,"Dit heeft mogelijk een effect op de resultaten."]
[]
[null,"Toelichting"]
[null,"Pers = personenwagens op daarvoor bestemde"]
[null,"          openbare plaatsen"]
[null,"Vracht = vrachtwagens op daarvoor bestemde"]
[null,"          parkeerplaatsen (middel- en zwaar vrachtverkeer)"]
[null,"Motor = geparkeerde motoren op openbare plaatsen"]
[null,"Obstakel / overig = obstakels of overige voertuigen"]
[null,"          geparkeerd op openbare plaatsen"]
[null,"Fout pers = personenwagens die fout geparkeerd staan"]
[null,"Fout vracht = vrachtwagens die fout geparkeerd staan"]
[null,"E-wagen = geparkeerde elektrisch voertuig bij een"]
[null,"          elektrisch oplaadpunt"]
[null,"Invalide = personenwagens en motoren op voor"]
[null,"          invalide personen bestemde parkeerplaats"]
[null,"Gestalde fietsen = alle gestalde fietsen op de"]
[null,"          daarvoor bestemde parkeerplaatsen"]

{"sheet":"66.Jabbeke-Oost","index":63,"n_rows":57,"n_cols":26,"rows_kept":57,"cut":false,"hidden":false,"merged":[[4,3,5,12],[4,16,5,16],[15,3,16,12]]}
[]
[null,"PARKEERONDERZOEK",null,"CARPOOLPARKINGS EN P+R PARKINGS"]
[null,66,null,{"$f":"B8 & \" - \"& TEXT(VLOOKUP(B3,Coordinaten!$A$2:$G$95,7,0),\"dddd dd mmmm jjjj\")","v":"Carpool parking Jabbeke-Oost, Jabbeke - dinsdag 09 november 2021"}]
[null,{"$f":"VLOOKUP(B3,Coordinaten!$A$2:$G$95,6,0)","v":"51.180310, 3.113845"}]
[null,null,null,"BEZETTING  ",null,null,null,null,null,null,null,null,null,null,null,null,"OPMERKINGEN"]
[]
[null,"Onderzoeksgebied",null,"Datum","Geregistreerd tussen","Pers","Vracht","Motor","Obstakel / overig","Fout   pers","Fout Vracht","Totaal","E-wagen\nplaats","Invalidenplaats","Gestalde fietsen",null,null,null,null,null,{"$f":"F7","v":"Pers"},"Vracht","Motor","Obstakel / overig","Fout   pers","Fout Vracht"]
[null,{"$f":"VLOOKUP(B3,Coordinaten!$A$2:$G$95,3,0)&\", \"&VLOOKUP(B3,Coordinaten!$A$2:$G$95,5,0)","v":"Carpool parking Jabbeke-Oost, Jabbeke"},null,"2021-11-09","09:00 - 16:00u",24,5,0,0,0,1,30,0,0,0,null,0,null,{"$f":"D8","v":"2021-11-09"},{"$f":"E8","v":"09:00 - 16:00u"},{"$f":"IF(F8=0,NA(),F8/$L8)","v":0.8},{"$f":"IF(G8=0,NA(),G8/$L8)","v":0.16666666666666666},{"$f":"IF(H8=0,NA(),H8/$L8)","v":{"$error":"#N/A"}},{"$error":"#N/A"},{"$error":"#N/A"},3.3333333333333333E-2]
[null,{"$f":"\"Nabij kruispunt: \"&VLOOKUP(B3,Coordinaten!$A$2:$L$95,4,0)","v":"Nabij kruispunt: N376 / Vlamingveld"},null,null,null,0.8,0.16666666666666666,"-","-","-",3.3333333333333333E-2,1,null,null,null,null,0,null,{"$f":"D10","v":"2021-11-09"},{"$f":"E10","v":"19:00 - 02:00u"},{"$f":"IF(F10=0,NA(),F10/$L10)","v":0.90909090909090906},{"$f":"IF(G10=0,NA(),G10/$L10)","v":9.0909090909090912E-2},{"$error":"#N/A"},{"$error":"#N/A"},{"$error":"#N/A"},{"$error":"#N/A"}]
[null,null,null,"2021-11-09","19:00 - 02:00u",10,1,0,0,0,0,11,0,0,0,null,0]
[null,"Meting",null,null,null,0.90909090909090906,9.0909090909090912E-2,"-","-","-","-",1,null,null,null,null,0]
[null,{"$f":"\"Meetperiode: \"&TEXT(VLOOKUP(B3,Coordinaten!$A$2:$G$95,7,0),\"dddd dd mmmm jjjj\")","v":"Meetperiode: dinsdag 09 november 2021"}]
[null,"Methodiek: Parkeerdrukmeting met waarnemers"]
[null,"In opdracht van: Vlaamse overheid"]
[null,"Uitgevoerd door: Dufec"]
[null,null,null,"VERDELING NAAR CATEGORIE"]
[null,"Locatie"]
[null,{"$f":"IF(B4=\"\",\"\",HYPERLINK(\"http://www.googlemaps.com/?q=\"&B4,\"Lat/Long: \"&B4))","v":"Lat/Long: 51.180310, 3.113845"}]
[]
[null,null,null,null,null,null,null,null,null,null,null,null,null,null,null,"Legenda"]
[null,null,null,null,null,null,null,null,null,null,null,null,null,null,null,null,"Personenwagen"]
[null,null,null,null,null,null,null,null,null,null,null,null,null,null,null,null,"Vracht"]
[null,null,null,null,null,null,null,null,null,null,null,null,null,null,null,null,"Motor"]
[null,null,null,null,null,null,null,null,null,null,null,null,null,null,null,null,"Obstakel / overig"]
[null,null,null,null,null,null,null,null,null,null,null,null,null,null,null,null,"Fout personenwagen"]
[null,null,null,null,null,null,null,null,null,null,null,null,null,null,null,null,"Fout Vracht"]
[]
[]
[]
[]
[]
[]
[]
[]
[]
[]
[]
[null,"Opmerking"]
[null,"Het onderzoek vindt plaats gedurende coronamaatregelen."]
[null,"Dit heeft mogelijk een effect op de resultaten."]
[]
[null,"Toelichting"]
[null,"Pers = personenwagens op daarvoor bestemde"]
[null,"          openbare plaatsen"]
[null,"Vracht = vrachtwagens op daarvoor bestemde"]
[null,"          parkeerplaatsen (middel- en zwaar vrachtverkeer)"]
[null,"Motor = geparkeerde motoren op openbare plaatsen"]
[null,"Obstakel / overig = obstakels of overige voertuigen"]
[null,"          geparkeerd op openbare plaatsen"]
[null,"Fout pers = personenwagens die fout geparkeerd staan"]
[null,"Fout vracht = vrachtwagens die fout geparkeerd staan"]
[null,"E-wagen = geparkeerde elektrisch voertuig bij een"]
[null,"          elektrisch oplaadpunt"]
[null,"Invalide = personenwagens en motoren op voor"]
[null,"          invalide personen bestemde parkeerplaats"]
[null,"Gestalde fietsen = alle gestalde fietsen op de"]
[null,"          daarvoor bestemde parkeerplaatsen"]

{"sheet":"67.Waregem","index":64,"n_rows":57,"n_cols":26,"rows_kept":57,"cut":false,"hidden":false,"merged":[[4,3,5,12],[4,16,5,16],[15,3,16,12]]}
[]
[null,"PARKEERONDERZOEK",null,"CARPOOLPARKINGS EN P+R PARKINGS"]
[null,67,null,{"$f":"B8 & \" - \"& TEXT(VLOOKUP(B3,Coordinaten!$A$2:$G$95,7,0),\"dddd dd mmmm jjjj\")","v":"Carpool parking Waregem, Waregem - dinsdag 23 november 2021"}]
[null,{"$f":"VLOOKUP(B3,Coordinaten!$A$2:$G$95,6,0)","v":"50.873938, 3.441505"}]
[null,null,null,"BEZETTING  ",null,null,null,null,null,null,null,null,null,null,null,null,"OPMERKINGEN"]
[]
[null,"Onderzoeksgebied",null,"Datum","Geregistreerd tussen","Pers","Vracht","Motor","Obstakel / overig","Fout   pers","Fout Vracht","Totaal","E-wagen\nplaats","Invalidenplaats","Gestalde fietsen",null,null,null,null,null,{"$f":"F7","v":"Pers"},"Vracht","Motor","Obstakel / overig","Fout   pers","Fout Vracht"]
[null,{"$f":"VLOOKUP(B3,Coordinaten!$A$2:$G$95,3,0)&\", \"&VLOOKUP(B3,Coordinaten!$A$2:$G$95,5,0)","v":"Carpool parking Waregem, Waregem"},null,"2021-11-23","09:00 - 16:00u",31,0,0,0,0,0,31,0,0,0,null,"Vanaf 20 november nieuwe coronamaatregelen, waaronder verplicht telewerk",null,{"$f":"D8","v":"2021-11-23"},{"$f":"E8","v":"09:00 - 16:00u"},{"$f":"IF(F8=0,NA(),F8/$L8)","v":1},{"$f":"IF(G8=0,NA(),G8/$L8)","v":{"$error":"#N/A"}},{"$f":"IF(H8=0,NA(),H8/$L8)","v":{"$error":"#N/A"}},{"$error":"#N/A"},{"$error":"#N/A"},{"$error":"#N/A"}]
[null,{"$f":"\"Nabij kruispunt: \"&VLOOKUP(B3,Coordinaten!$A$2:$L$95,4,0)","v":"Nabij kruispunt: N357 / Franklin Rooseveltlaan"},null,null,null,1,"-","-","-","-","-",1,null,null,null,null,0,null,{"$f":"D10","v":"2021-11-23"},{"$f":"E10","v":"19:00 - 02:00u"},{"$f":"IF(F10=0,NA(),F10/$L10)","v":1},{"$f":"IF(G10=0,NA(),G10/$L10)","v":{"$error":"#N/A"}},{"$error":"#N/A"},{"$error":"#N/A"},{"$error":"#N/A"},{"$error":"#N/A"}]
[null,null,null,"2021-11-23","19:00 - 02:00u",16,0,0,0,0,0,16,0,0,0,null,"Vanaf 20 november nieuwe coronamaatregelen, waaronder verplicht telewerk"]
[null,"Meting",null,null,null,1,"-","-","-","-","-",1,null,null,null,null,0]
[null,{"$f":"\"Meetperiode: \"&TEXT(VLOOKUP(B3,Coordinaten!$A$2:$G$95,7,0),\"dddd dd mmmm jjjj\")","v":"Meetperiode: dinsdag 23 november 2021"}]
[null,"Methodiek: Parkeerdrukmeting met waarnemers"]
[null,"In opdracht van: Vlaamse overheid"]
[null,"Uitgevoerd door: Dufec"]
[null,null,null,"VERDELING NAAR CATEGORIE"]
[null,"Locatie"]
[null,{"$f":"IF(B4=\"\",\"\",HYPERLINK(\"http://www.googlemaps.com/?q=\"&B4,\"Lat/Long: \"&B4))","v":"Lat/Long: 50.873938, 3.441505"}]
[]
[null,null,null,null,null,null,null,null,null,null,null,null,null,null,null,"Legenda"]
[null,null,null,null,null,null,null,null,null,null,null,null,null,null,null,null,"Personenwagen"]
[null,null,null,null,null,null,null,null,null,null,null,null,null,null,null,null,"Vracht"]
[null,null,null,null,null,null,null,null,null,null,null,null,null,null,null,null,"Motor"]
[null,null,null,null,null,null,null,null,null,null,null,null,null,null,null,null,"Obstakel / overig"]
[null,null,null,null,null,null,null,null,null,null,null,null,null,null,null,null,"Fout personenwagen"]
[null,null,null,null,null,null,null,null,null,null,null,null,null,null,null,null,"Fout Vracht"]
[]
[]
[]
[]
[]
[]
[]
[]
[]
[]
[]
[null,"Opmerking"]
[null,"Het onderzoek vindt plaats gedurende coronamaatregelen."]
[null,"Dit heeft mogelijk een effect op de resultaten."]
[]
[null,"Toelichting"]
[null,"Pers = personenwagens op daarvoor bestemde"]
[null,"          openbare plaatsen"]
[null,"Vracht = vrachtwagens op daarvoor bestemde"]
[null,"          parkeerplaatsen (middel- en zwaar vrachtverkeer)"]
[null,"Motor = geparkeerde motoren op openbare plaatsen"]
[null,"Obstakel / overig = obstakels of overige voertuigen"]
[null,"          geparkeerd op openbare plaatsen"]
[null,"Fout pers = personenwagens die fout geparkeerd staan"]
[null,"Fout vracht = vrachtwagens die fout geparkeerd staan"]
[null,"E-wagen = geparkeerde elektrisch voertuig bij een"]
[null,"          elektrisch oplaadpunt"]
[null,"Invalide = personenwagens en motoren op voor"]
[null,"          invalide personen bestemde parkeerplaats"]
[null,"Gestalde fietsen = alle gestalde fietsen op de"]
[null,"          daarvoor bestemde parkeerplaatsen"]

{"sheet":"68.Zandvoorde","index":65,"n_rows":57,"n_cols":26,"rows_kept":57,"cut":false,"hidden":false,"merged":[[4,3,5,12],[4,16,5,16],[15,3,16,12]]}
[]
[null,"PARKEERONDERZOEK",null,"CARPOOLPARKINGS EN P+R PARKINGS"]
[null,68,null,{"$f":"B8 & \" - \"& TEXT(VLOOKUP(B3,Coordinaten!$A$2:$G$95,7,0),\"dddd dd mmmm jjjj\")","v":"Carpool parking Zandvoorde, Oostende - dinsdag 09 november 2021"}]
[null,{"$f":"VLOOKUP(B3,Coordinaten!$A$2:$G$95,6,0)","v":"51.204204, 2.976173"}]
[null,null,null,"BEZETTING  ",null,null,null,null,null,null,null,null,null,null,null,null,"OPMERKINGEN"]
[]
[null,"Onderzoeksgebied",null,"Datum","Geregistreerd tussen","Pers","Vracht","Motor","Obstakel / overig","Fout   pers","Fout Vracht","Totaal","E-wagen\nplaats","Invalidenplaats","Gestalde fietsen",null,null,null,null,null,{"$f":"F7","v":"Pers"},"Vracht","Motor","Obstakel / overig","Fout   pers","Fout Vracht"]
[null,{"$f":"VLOOKUP(B3,Coordinaten!$A$2:$G$95,3,0)&\", \"&VLOOKUP(B3,Coordinaten!$A$2:$G$95,5,0)","v":"Carpool parking Zandvoorde, Oostende"},null,"2021-11-09","09:00 - 16:00u",3,0,0,0,0,0,3,0,0,0,null,0,null,{"$f":"D8","v":"2021-11-09"},{"$f":"E8","v":"09:00 - 16:00u"},{"$f":"IF(F8=0,NA(),F8/$L8)","v":1},{"$f":"IF(G8=0,NA(),G8/$L8)","v":{"$error":"#N/A"}},{"$f":"IF(H8=0,NA(),H8/$L8)","v":{"$error":"#N/A"}},{"$error":"#N/A"},{"$error":"#N/A"},{"$error":"#N/A"}]
[null,{"$f":"\"Nabij kruispunt: \"&VLOOKUP(B3,Coordinaten!$A$2:$L$95,4,0)","v":"Nabij kruispunt: A10 / Kasteelstraat"},null,null,null,1,"-","-","-","-","-",1,null,null,null,null,0,null,{"$f":"D10","v":"2021-11-09"},{"$f":"E10","v":"19:00 - 02:00u"},{"$f":"IF(F10=0,NA(),F10/$L10)","v":1},{"$f":"IF(G10=0,NA(),G10/$L10)","v":{"$error":"#N/A"}},{"$error":"#N/A"},{"$error":"#N/A"},{"$error":"#N/A"},{"$error":"#N/A"}]
[null,null,null,"2021-11-09","19:00 - 02:00u",2,0,0,0,0,0,2,0,0,0,null,0]
[null,"Meting",null,null,null,1,"-","-","-","-","-",1,null,null,null,null,0]
[null,{"$f":"\"Meetperiode: \"&TEXT(VLOOKUP(B3,Coordinaten!$A$2:$G$95,7,0),\"dddd dd mmmm jjjj\")","v":"Meetperiode: dinsdag 09 november 2021"}]
[null,"Methodiek: Parkeerdrukmeting met waarnemers"]
[null,"In opdracht van: Vlaamse overheid"]
[null,"Uitgevoerd door: Dufec"]
[null,null,null,"VERDELING NAAR CATEGORIE"]
[null,"Locatie"]
[null,{"$f":"IF(B4=\"\",\"\",HYPERLINK(\"http://www.googlemaps.com/?q=\"&B4,\"Lat/Long: \"&B4))","v":"Lat/Long: 51.204204, 2.976173"}]
[]
[null,null,null,null,null,null,null,null,null,null,null,null,null,null,null,"Legenda"]
[null,null,null,null,null,null,null,null,null,null,null,null,null,null,null,null,"Personenwagen"]
[null,null,null,null,null,null,null,null,null,null,null,null,null,null,null,null,"Vracht"]
[null,null,null,null,null,null,null,null,null,null,null,null,null,null,null,null,"Motor"]
[null,null,null,null,null,null,null,null,null,null,null,null,null,null,null,null,"Obstakel / overig"]
[null,null,null,null,null,null,null,null,null,null,null,null,null,null,null,null,"Fout personenwagen"]
[null,null,null,null,null,null,null,null,null,null,null,null,null,null,null,null,"Fout Vracht"]
[]
[]
[]
[]
[]
[]
[]
[]
[]
[]
[]
[null,"Opmerking"]
[null,"Het onderzoek vindt plaats gedurende coronamaatregelen."]
[null,"Dit heeft mogelijk een effect op de resultaten."]
[]
[null,"Toelichting"]
[null,"Pers = personenwagens op daarvoor bestemde"]
[null,"          openbare plaatsen"]
[null,"Vracht = vrachtwagens op daarvoor bestemde"]
[null,"          parkeerplaatsen (middel- en zwaar vrachtverkeer)"]
[null,"Motor = geparkeerde motoren op openbare plaatsen"]
[null,"Obstakel / overig = obstakels of overige voertuigen"]
[null,"          geparkeerd op openbare plaatsen"]
[null,"Fout pers = personenwagens die fout geparkeerd staan"]
[null,"Fout vracht = vrachtwagens die fout geparkeerd staan"]
[null,"E-wagen = geparkeerde elektrisch voertuig bij een"]
[null,"          elektrisch oplaadpunt"]
[null,"Invalide = personenwagens en motoren op voor"]
[null,"          invalide personen bestemde parkeerplaats"]
[null,"Gestalde fietsen = alle gestalde fietsen op de"]
[null,"          daarvoor bestemde parkeerplaatsen"]

{"sheet":"69.Beernem","index":66,"n_rows":57,"n_cols":26,"rows_kept":57,"cut":false,"hidden":false,"merged":[[4,3,5,12],[4,16,5,16],[15,3,16,12]]}
[]
[null,"PARKEERONDERZOEK",null,"CARPOOLPARKINGS EN P+R PARKINGS"]
[null,69,null,{"$f":"B8 & \" - \"& TEXT(VLOOKUP(B3,Coordinaten!$A$2:$G$95,7,0),\"dddd dd mmmm jjjj\")","v":"Carpool parking Beernem, Beernem - dinsdag 09 november 2021"}]
[null,{"$f":"VLOOKUP(B3,Coordinaten!$A$2:$G$95,6,0)","v":"51.120332, 3.324059"}]
[null,null,null,"BEZETTING  ",null,null,null,null,null,null,null,null,null,null,null,null,"OPMERKINGEN"]
[]
[null,"Onderzoeksgebied",null,"Datum","Geregistreerd tussen","Pers","Vracht","Motor","Obstakel / overig","Fout   pers","Fout Vracht","Totaal","E-wagen\nplaats","Invalidenplaats","Gestalde fietsen",null,null,null,null,null,{"$f":"F7","v":"Pers"},"Vracht","Motor","Obstakel / overig","Fout   pers","Fout Vracht"]
[null,{"$f":"VLOOKUP(B3,Coordinaten!$A$2:$G$95,3,0)&\", \"&VLOOKUP(B3,Coordinaten!$A$2:$G$95,5,0)","v":"Carpool parking Beernem, Beernem"},null,"2021-11-09","09:00 - 16:00u",24,0,0,0,0,0,24,0,0,0,null,0,null,{"$f":"D8","v":"2021-11-09"},{"$f":"E8","v":"09:00 - 16:00u"},{"$f":"IF(F8=0,NA(),F8/$L8)","v":1},{"$f":"IF(G8=0,NA(),G8/$L8)","v":{"$error":"#N/A"}},{"$f":"IF(H8=0,NA(),H8/$L8)","v":{"$error":"#N/A"}},{"$error":"#N/A"},{"$error":"#N/A"},{"$error":"#N/A"}]
[null,{"$f":"\"Nabij kruispunt: \"&VLOOKUP(B3,Coordinaten!$A$2:$L$95,4,0)","v":"Nabij kruispunt: N370 / A10"},null,null,null,1,"-","-","-","-","-",1,null,null,null,null,0,null,{"$f":"D10","v":"2021-11-09"},{"$f":"E10","v":"19:00 - 02:00u"},{"$f":"IF(F10=0,NA(),F10/$L10)","v":0.42857142857142855},{"$f":"IF(G10=0,NA(),G10/$L10)","v":{"$error":"#N/A"}},{"$error":"#N/A"},{"$error":"#N/A"},0.14285714285714285,0.42857142857142855]
[null,null,null,"2021-11-09","19:00 - 02:00u",3,0,0,0,1,3,7,0,0,0,null,0]
[null,"Meting",null,null,null,0.42857142857142855,"-","-","-",0.14285714285714285,0.42857142857142855,1,null,null,null,null,0]
[null,{"$f":"\"Meetperiode: \"&TEXT(VLOOKUP(B3,Coordinaten!$A$2:$G$95,7,0),\"dddd dd mmmm jjjj\")","v":"Meetperiode: dinsdag 09 november 2021"}]
[null,"Methodiek: Parkeerdrukmeting met waarnemers"]
[null,"In opdracht van: Vlaamse overheid"]
[null,"Uitgevoerd door: Dufec"]
[null,null,null,"VERDELING NAAR CATEGORIE"]
[null,"Locatie"]
[null,{"$f":"IF(B4=\"\",\"\",HYPERLINK(\"http://www.googlemaps.com/?q=\"&B4,\"Lat/Long: \"&B4))","v":"Lat/Long: 51.120332, 3.324059"}]
[]
[null,null,null,null,null,null,null,null,null,null,null,null,null,null,null,"Legenda"]
[null,null,null,null,null,null,null,null,null,null,null,null,null,null,null,null,"Personenwagen"]
[null,null,null,null,null,null,null,null,null,null,null,null,null,null,null,null,"Vracht"]
[null,null,null,null,null,null,null,null,null,null,null,null,null,null,null,null,"Motor"]
[null,null,null,null,null,null,null,null,null,null,null,null,null,null,null,null,"Obstakel / overig"]
[null,null,null,null,null,null,null,null,null,null,null,null,null,null,null,null,"Fout personenwagen"]
[null,null,null,null,null,null,null,null,null,null,null,null,null,null,null,null,"Fout Vracht"]
[]
[]
[]
[]
[]
[]
[]
[]
[]
[]
[]
[null,"Opmerking"]
[null,"Het onderzoek vindt plaats gedurende coronamaatregelen."]
[null,"Dit heeft mogelijk een effect op de resultaten."]
[]
[null,"Toelichting"]
[null,"Pers = personenwagens op daarvoor bestemde"]
[null,"          openbare plaatsen"]
[null,"Vracht = vrachtwagens op daarvoor bestemde"]
[null,"          parkeerplaatsen (middel- en zwaar vrachtverkeer)"]
[null,"Motor = geparkeerde motoren op openbare plaatsen"]
[null,"Obstakel / overig = obstakels of overige voertuigen"]
[null,"          geparkeerd op openbare plaatsen"]
[null,"Fout pers = personenwagens die fout geparkeerd staan"]
[null,"Fout vracht = vrachtwagens die fout geparkeerd staan"]
[null,"E-wagen = geparkeerde elektrisch voertuig bij een"]
[null,"          elektrisch oplaadpunt"]
[null,"Invalide = personenwagens en motoren op voor"]
[null,"          invalide personen bestemde parkeerplaats"]
[null,"Gestalde fietsen = alle gestalde fietsen op de"]
[null,"          daarvoor bestemde parkeerplaatsen"]

{"sheet":"70.The Loop-Expo","index":67,"n_rows":57,"n_cols":26,"rows_kept":57,"cut":false,"hidden":false,"merged":[[4,3,5,12],[4,16,5,16],[15,3,16,12]]}
[]
[null,"PARKEERONDERZOEK",null,"CARPOOLPARKINGS EN P+R PARKINGS"]
[null,70,null,{"$f":"B8 & \" - \"& TEXT(VLOOKUP(B3,Coordinaten!$A$2:$G$95,7,0),\"dddd dd mmmm jjjj\")","v":"P+R parking The Loop/Expo, Gent - dinsdag 23 november 2021"}]
[null,{"$f":"VLOOKUP(B3,Coordinaten!$A$2:$G$95,6,0)","v":"51.024607, 3.695634"}]
[null,null,null,"BEZETTING  ",null,null,null,null,null,null,null,null,null,null,null,null,"OPMERKINGEN"]
[]
[null,"Onderzoeksgebied",null,"Datum","Geregistreerd tussen","Pers","Vracht","Motor","Obstakel / overig","Fout   pers","Fout Vracht","Totaal","E-wagen\nplaats","Invalidenplaats","Gestalde fietsen",null,null,null,null,null,{"$f":"F7","v":"Pers"},"Vracht","Motor","Obstakel / overig","Fout   pers","Fout Vracht"]
[null,{"$f":"VLOOKUP(B3,Coordinaten!$A$2:$G$95,3,0)&\", \"&VLOOKUP(B3,Coordinaten!$A$2:$G$95,5,0)","v":"P+R parking The Loop/Expo, Gent"},null,"2021-11-23","09:00 - 16:00u",180,0,0,0,14,0,194,1,0,0,null,"Vanaf 20 november nieuwe coronamaatregelen, waaronder verplicht telewerk",null,{"$f":"D8","v":"2021-11-23"},{"$f":"E8","v":"09:00 - 16:00u"},{"$f":"IF(F8=0,NA(),F8/$L8)","v":0.92783505154639179},{"$f":"IF(G8=0,NA(),G8/$L8)","v":{"$error":"#N/A"}},{"$f":"IF(H8=0,NA(),H8/$L8)","v":{"$error":"#N/A"}},{"$error":"#N/A"},7.2164948453608241E-2,{"$error":"#N/A"}]
[null,{"$f":"\"Nabij kruispunt: \"&VLOOKUP(B3,Coordinaten!$A$2:$L$95,4,0)","v":"Nabij kruispunt: Derbystraat / Hélène Dutrieulaan"},null,null,null,0.92783505154639179,"-","-","-",7.2164948453608241E-2,"-",1,null,null,null,null,0,null,{"$f":"D10","v":"2021-11-23"},{"$f":"E10","v":"19:00 - 02:00u"},{"$f":"IF(F10=0,NA(),F10/$L10)","v":1},{"$f":"IF(G10=0,NA(),G10/$L10)","v":{"$error":"#N/A"}},{"$error":"#N/A"},{"$error":"#N/A"},{"$error":"#N/A"},{"$error":"#N/A"}]
[null,null,null,"2021-11-23","19:00 - 02:00u",107,0,0,0,0,0,107,1,0,16,null,"Vanaf 20 november nieuwe coronamaatregelen, waaronder verplicht telewerk"]
[null,"Meting",null,null,null,1,"-","-","-","-","-",1,null,null,null,null,0]
[null,{"$f":"\"Meetperiode: \"&TEXT(VLOOKUP(B3,Coordinaten!$A$2:$G$95,7,0),\"dddd dd mmmm jjjj\")","v":"Meetperiode: dinsdag 23 november 2021"}]
[null,"Methodiek: Parkeerdrukmeting met waarnemers"]
[null,"In opdracht van: Vlaamse overheid"]
[null,"Uitgevoerd door: Dufec"]
[null,null,null,"VERDELING NAAR CATEGORIE"]
[null,"Locatie"]
[null,{"$f":"IF(B4=\"\",\"\",HYPERLINK(\"http://www.googlemaps.com/?q=\"&B4,\"Lat/Long: \"&B4))","v":"Lat/Long: 51.024607, 3.695634"}]
[]
[null,null,null,null,null,null,null,null,null,null,null,null,null,null,null,"Legenda"]
[null,null,null,null,null,null,null,null,null,null,null,null,null,null,null,null,"Personenwagen"]
[null,null,null,null,null,null,null,null,null,null,null,null,null,null,null,null,"Vracht"]
[null,null,null,null,null,null,null,null,null,null,null,null,null,null,null,null,"Motor"]
[null,null,null,null,null,null,null,null,null,null,null,null,null,null,null,null,"Obstakel / overig"]
[null,null,null,null,null,null,null,null,null,null,null,null,null,null,null,null,"Fout personenwagen"]
[null,null,null,null,null,null,null,null,null,null,null,null,null,null,null,null,"Fout Vracht"]
[]
[]
[]
[]
[]
[]
[]
[]
[]
[]
[]
[null,"Opmerking"]
[null,"Het onderzoek vindt plaats gedurende coronamaatregelen."]
[null,"Dit heeft mogelijk een effect op de resultaten."]
[]
[null,"Toelichting"]
[null,"Pers = personenwagens op daarvoor bestemde"]
[null,"          openbare plaatsen"]
[null,"Vracht = vrachtwagens op daarvoor bestemde"]
[null,"          parkeerplaatsen (middel- en zwaar vrachtverkeer)"]
[null,"Motor = geparkeerde motoren op openbare plaatsen"]
[null,"Obstakel / overig = obstakels of overige voertuigen"]
[null,"          geparkeerd op openbare plaatsen"]
[null,"Fout pers = personenwagens die fout geparkeerd staan"]
[null,"Fout vracht = vrachtwagens die fout geparkeerd staan"]
[null,"E-wagen = geparkeerde elektrisch voertuig bij een"]
[null,"          elektrisch oplaadpunt"]
[null,"Invalide = personenwagens en motoren op voor"]
[null,"          invalide personen bestemde parkeerplaats"]
[null,"Gestalde fietsen = alle gestalde fietsen op de"]
[null,"          daarvoor bestemde parkeerplaatsen"]

{"sheet":"72.Veurne","index":68,"n_rows":57,"n_cols":26,"rows_kept":57,"cut":false,"hidden":false,"merged":[[4,3,5,12],[4,16,5,16],[15,3,16,12]]}
[]
[null,"PARKEERONDERZOEK",null,"CARPOOLPARKINGS EN P+R PARKINGS"]
[null,72,null,{"$f":"B8 & \" - \"& TEXT(VLOOKUP(B3,Coordinaten!$A$2:$G$95,7,0),\"dddd dd mmmm jjjj\")","v":"Carpool parking Veurne, Veurne - dinsdag 09 november 2021"}]
[null,{"$f":"VLOOKUP(B3,Coordinaten!$A$2:$G$95,6,0)","v":"51.057349, 2.667068"}]
[null,null,null,"BEZETTING  ",null,null,null,null,null,null,null,null,null,null,null,null,"OPMERKINGEN"]
[]
[null,"Onderzoeksgebied",null,"Datum","Geregistreerd tussen","Pers","Vracht","Motor","Obstakel / overig","Fout   pers","Fout Vracht","Totaal","E-wagen\nplaats","Invalidenplaats","Gestalde fietsen",null,null,null,null,null,{"$f":"F7","v":"Pers"},"Vracht","Motor","Obstakel / overig","Fout   pers","Fout Vracht"]
[null,{"$f":"VLOOKUP(B3,Coordinaten!$A$2:$G$95,3,0)&\", \"&VLOOKUP(B3,Coordinaten!$A$2:$G$95,5,0)","v":"Carpool parking Veurne, Veurne"},null,"2021-11-09","09:00 - 16:00u",16,0,0,1,0,1,18,0,0,0,null,"Obstakel: aanhanger",null,{"$f":"D8","v":"2021-11-09"},{"$f":"E8","v":"09:00 - 16:00u"},{"$f":"IF(F8=0,NA(),F8/$L8)","v":0.88888888888888884},{"$f":"IF(G8=0,NA(),G8/$L8)","v":{"$error":"#N/A"}},{"$f":"IF(H8=0,NA(),H8/$L8)","v":{"$error":"#N/A"}},5.5555555555555552E-2,{"$error":"#N/A"},5.5555555555555552E-2]
[null,{"$f":"\"Nabij kruispunt: \"&VLOOKUP(B3,Coordinaten!$A$2:$L$95,4,0)","v":"Nabij kruispunt: N8 / A18"},null,null,null,0.88888888888888884,"-","-",5.5555555555555552E-2,"-",5.5555555555555552E-2,1,null,null,null,null,0,null,{"$f":"D10","v":"2021-11-09"},{"$f":"E10","v":"19:00 - 02:00u"},{"$f":"IF(F10=0,NA(),F10/$L10)","v":1},{"$f":"IF(G10=0,NA(),G10/$L10)","v":{"$error":"#N/A"}},{"$error":"#N/A"},{"$error":"#N/A"},{"$error":"#N/A"},{"$error":"#N/A"}]
[null,null,null,"2021-11-09","19:00 - 02:00u",1,0,0,0,0,0,1,0,0,0,null,0]
[null,"Meting",null,null,null,1,"-","-","-","-","-",1,null,null,null,null,0]
[null,{"$f":"\"Meetperiode: \"&TEXT(VLOOKUP(B3,Coordinaten!$A$2:$G$95,7,0),\"dddd dd mmmm jjjj\")","v":"Meetperiode: dinsdag 09 november 2021"}]
[null,"Methodiek: Parkeerdrukmeting met waarnemers"]
[null,"In opdracht van: Vlaamse overheid"]
[null,"Uitgevoerd door: Dufec"]
[null,null,null,"VERDELING NAAR CATEGORIE"]
[null,"Locatie"]
[null,{"$f":"IF(B4=\"\",\"\",HYPERLINK(\"http://www.googlemaps.com/?q=\"&B4,\"Lat/Long: \"&B4))","v":"Lat/Long: 51.057349, 2.667068"}]
[]
[null,null,null,null,null,null,null,null,null,null,null,null,null,null,null,"Legenda"]
[null,null,null,null,null,null,null,null,null,null,null,null,null,null,null,null,"Personenwagen"]
[null,null,null,null,null,null,null,null,null,null,null,null,null,null,null,null,"Vracht"]
[null,null,null,null,null,null,null,null,null,null,null,null,null,null,null,null,"Motor"]
[null,null,null,null,null,null,null,null,null,null,null,null,null,null,null,null,"Obstakel / overig"]
[null,null,null,null,null,null,null,null,null,null,null,null,null,null,null,null,"Fout personenwagen"]
[null,null,null,null,null,null,null,null,null,null,null,null,null,null,null,null,"Fout Vracht"]
[]
[]
[]
[]
[]
[]
[]
[]
[]
[]
[]
[null,"Opmerking"]
[null,"Het onderzoek vindt plaats gedurende coronamaatregelen."]
[null,"Dit heeft mogelijk een effect op de resultaten."]
[]
[null,"Toelichting"]
[null,"Pers = personenwagens op daarvoor bestemde"]
[null,"          openbare plaatsen"]
[null,"Vracht = vrachtwagens op daarvoor bestemde"]
[null,"          parkeerplaatsen (middel- en zwaar vrachtverkeer)"]
[null,"Motor = geparkeerde motoren op openbare plaatsen"]
[null,"Obstakel / overig = obstakels of overige voertuigen"]
[null,"          geparkeerd op openbare plaatsen"]
[null,"Fout pers = personenwagens die fout geparkeerd staan"]
[null,"Fout vracht = vrachtwagens die fout geparkeerd staan"]
[null,"E-wagen = geparkeerde elektrisch voertuig bij een"]
[null,"          elektrisch oplaadpunt"]
[null,"Invalide = personenwagens en motoren op voor"]
[null,"          invalide personen bestemde parkeerplaats"]
[null,"Gestalde fietsen = alle gestalde fietsen op de"]
[null,"          daarvoor bestemde parkeerplaatsen"]

{"sheet":"73.Jabbeke-West","index":69,"n_rows":57,"n_cols":26,"rows_kept":57,"cut":false,"hidden":false,"merged":[[4,3,5,12],[4,16,5,16],[15,3,16,12]]}
[]
[null,"PARKEERONDERZOEK",null,"CARPOOLPARKINGS EN P+R PARKINGS"]
[null,73,null,{"$f":"B8 & \" - \"& TEXT(VLOOKUP(B3,Coordinaten!$A$2:$G$95,7,0),\"dddd dd mmmm jjjj\")","v":"Carpool parking Jabbeke-West, Jabbeke - dinsdag 09 november 2021"}]
[null,{"$f":"VLOOKUP(B3,Coordinaten!$A$2:$G$95,6,0)","v":"51.187549, 3.093136"}]
[null,null,null,"BEZETTING  ",null,null,null,null,null,null,null,null,null,null,null,null,"OPMERKINGEN"]
[]
[null,"Onderzoeksgebied",null,"Datum","Geregistreerd tussen","Pers","Vracht","Motor","Obstakel / overig","Fout   pers","Fout Vracht","Totaal","E-wagen\nplaats","Invalidenplaats","Gestalde fietsen",null,null,null,null,null,{"$f":"F7","v":"Pers"},"Vracht","Motor","Obstakel / overig","Fout   pers","Fout Vracht"]
[null,{"$f":"VLOOKUP(B3,Coordinaten!$A$2:$G$95,3,0)&\", \"&VLOOKUP(B3,Coordinaten!$A$2:$G$95,5,0)","v":"Carpool parking Jabbeke-West, Jabbeke"},null,"2021-11-09","09:00 - 16:00u",7,0,0,0,0,0,7,0,0,0,null,0,null,{"$f":"D8","v":"2021-11-09"},{"$f":"E8","v":"09:00 - 16:00u"},{"$f":"IF(F8=0,NA(),F8/$L8)","v":1},{"$f":"IF(G8=0,NA(),G8/$L8)","v":{"$error":"#N/A"}},{"$f":"IF(H8=0,NA(),H8/$L8)","v":{"$error":"#N/A"}},{"$error":"#N/A"},{"$error":"#N/A"},{"$error":"#N/A"}]
[null,{"$f":"\"Nabij kruispunt: \"&VLOOKUP(B3,Coordinaten!$A$2:$L$95,4,0)","v":"Nabij kruispunt: N377 / A10"},null,null,null,1,"-","-","-","-","-",1,null,null,null,null,0,null,{"$f":"D10","v":"2021-11-09"},{"$f":"E10","v":"19:00 - 02:00u"},{"$f":"IF(F10=0,NA(),F10/$L10)","v":1},{"$f":"IF(G10=0,NA(),G10/$L10)","v":{"$error":"#N/A"}},{"$error":"#N/A"},{"$error":"#N/A"},{"$error":"#N/A"},{"$error":"#N/A"}]
[null,null,null,"2021-11-09","19:00 - 02:00u",2,0,0,0,0,0,2,0,0,0,null,0]
[null,"Meting",null,null,null,1,"-","-","-","-","-",1,null,null,null,null,0]
[null,{"$f":"\"Meetperiode: \"&TEXT(VLOOKUP(B3,Coordinaten!$A$2:$G$95,7,0),\"dddd dd mmmm jjjj\")","v":"Meetperiode: dinsdag 09 november 2021"}]
[null,"Methodiek: Parkeerdrukmeting met waarnemers"]
[null,"In opdracht van: Vlaamse overheid"]
[null,"Uitgevoerd door: Dufec"]
[null,null,null,"VERDELING NAAR CATEGORIE"]
[null,"Locatie"]
[null,{"$f":"IF(B4=\"\",\"\",HYPERLINK(\"http://www.googlemaps.com/?q=\"&B4,\"Lat/Long: \"&B4))","v":"Lat/Long: 51.187549, 3.093136"}]
[]
[null,null,null,null,null,null,null,null,null,null,null,null,null,null,null,"Legenda"]
[null,null,null,null,null,null,null,null,null,null,null,null,null,null,null,null,"Personenwagen"]
[null,null,null,null,null,null,null,null,null,null,null,null,null,null,null,null,"Vracht"]
[null,null,null,null,null,null,null,null,null,null,null,null,null,null,null,null,"Motor"]
[null,null,null,null,null,null,null,null,null,null,null,null,null,null,null,null,"Obstakel / overig"]
[null,null,null,null,null,null,null,null,null,null,null,null,null,null,null,null,"Fout personenwagen"]
[null,null,null,null,null,null,null,null,null,null,null,null,null,null,null,null,"Fout Vracht"]
[]
[]
[]
[]
[]
[]
[]
[]
[]
[]
[]
[null,"Opmerking"]
[null,"Het onderzoek vindt plaats gedurende coronamaatregelen."]
[null,"Dit heeft mogelijk een effect op de resultaten."]
[]
[null,"Toelichting"]
[null,"Pers = personenwagens op daarvoor bestemde"]
[null,"          openbare plaatsen"]
[null,"Vracht = vrachtwagens op daarvoor bestemde"]
[null,"          parkeerplaatsen (middel- en zwaar vrachtverkeer)"]
[null,"Motor = geparkeerde motoren op openbare plaatsen"]
[null,"Obstakel / overig = obstakels of overige voertuigen"]
[null,"          geparkeerd op openbare plaatsen"]
[null,"Fout pers = personenwagens die fout geparkeerd staan"]
[null,"Fout vracht = vrachtwagens die fout geparkeerd staan"]
[null,"E-wagen = geparkeerde elektrisch voertuig bij een"]
[null,"          elektrisch oplaadpunt"]
[null,"Invalide = personenwagens en motoren op voor"]
[null,"          invalide personen bestemde parkeerplaats"]
[null,"Gestalde fietsen = alle gestalde fietsen op de"]
[null,"          daarvoor bestemde parkeerplaatsen"]

{"sheet":"74.Melsele","index":70,"n_rows":57,"n_cols":26,"rows_kept":57,"cut":false,"hidden":false,"merged":[[4,3,5,12],[4,16,5,16],[15,3,16,12]]}
[]
[null,"PARKEERONDERZOEK",null,"CARPOOLPARKINGS EN P+R PARKINGS"]
[null,74,null,{"$f":"B8 & \" - \"& TEXT(VLOOKUP(B3,Coordinaten!$A$2:$G$95,7,0),\"dddd dd mmmm jjjj\")","v":"P+R parking Melsele, Beveren - dinsdag 09 november 2021"}]
[null,{"$f":"VLOOKUP(B3,Coordinaten!$A$2:$G$95,6,0)","v":"51.218385, 4.305929"}]
[null,null,null,"BEZETTING  ",null,null,null,null,null,null,null,null,null,null,null,null,"OPMERKINGEN"]
[]
[null,"Onderzoeksgebied",null,"Datum","Geregistreerd tussen","Pers","Vracht","Motor","Obstakel / overig","Fout   pers","Fout Vracht","Totaal","E-wagen\nplaats","Invalidenplaats","Gestalde fietsen",null,null,null,null,null,{"$f":"F7","v":"Pers"},"Vracht","Motor","Obstakel / overig","Fout   pers","Fout Vracht"]
[null,{"$f":"VLOOKUP(B3,Coordinaten!$A$2:$G$95,3,0)&\", \"&VLOOKUP(B3,Coordinaten!$A$2:$G$95,5,0)","v":"P+R parking Melsele, Beveren"},null,"2021-11-09","09:00 - 16:00u",105,0,0,0,0,0,105,0,2,102,null,0,null,{"$f":"D8","v":"2021-11-09"},{"$f":"E8","v":"09:00 - 16:00u"},{"$f":"IF(F8=0,NA(),F8/$L8)","v":1},{"$f":"IF(G8=0,NA(),G8/$L8)","v":{"$error":"#N/A"}},{"$f":"IF(H8=0,NA(),H8/$L8)","v":{"$error":"#N/A"}},{"$error":"#N/A"},{"$error":"#N/A"},{"$error":"#N/A"}]
[null,{"$f":"\"Nabij kruispunt: \"&VLOOKUP(B3,Coordinaten!$A$2:$L$95,4,0)","v":"Nabij kruispunt: N70 / N419"},null,null,null,1,"-","-","-","-","-",1,null,null,null,null,0,null,{"$f":"D10","v":"2021-11-09"},{"$f":"E10","v":"19:00 - 02:00u"},{"$f":"IF(F10=0,NA(),F10/$L10)","v":1},{"$f":"IF(G10=0,NA(),G10/$L10)","v":{"$error":"#N/A"}},{"$error":"#N/A"},{"$error":"#N/A"},{"$error":"#N/A"},{"$error":"#N/A"}]
[null,null,null,"2021-11-09","19:00 - 02:00u",79,0,0,0,0,0,79,0,0,0,null,0]
[null,"Meting",null,null,null,1,"-","-","-","-","-",1,null,null,null,null,0]
[null,{"$f":"\"Meetperiode: \"&TEXT(VLOOKUP(B3,Coordinaten!$A$2:$G$95,7,0),\"dddd dd mmmm jjjj\")","v":"Meetperiode: dinsdag 09 november 2021"}]
[null,"Methodiek: Parkeerdrukmeting met waarnemers"]
[null,"In opdracht van: Vlaamse overheid"]
[null,"Uitgevoerd door: Dufec"]
[null,null,null,"VERDELING NAAR CATEGORIE"]
[null,"Locatie"]
[null,{"$f":"IF(B4=\"\",\"\",HYPERLINK(\"http://www.googlemaps.com/?q=\"&B4,\"Lat/Long: \"&B4))","v":"Lat/Long: 51.218385, 4.305929"}]
[]
[null,null,null,null,null,null,null,null,null,null,null,null,null,null,null,"Legenda"]
[null,null,null,null,null,null,null,null,null,null,null,null,null,null,null,null,"Personenwagen"]
[null,null,null,null,null,null,null,null,null,null,null,null,null,null,null,null,"Vracht"]
[null,null,null,null,null,null,null,null,null,null,null,null,null,null,null,null,"Motor"]
[null,null,null,null,null,null,null,null,null,null,null,null,null,null,null,null,"Obstakel / overig"]
[null,null,null,null,null,null,null,null,null,null,null,null,null,null,null,null,"Fout personenwagen"]
[null,null,null,null,null,null,null,null,null,null,null,null,null,null,null,null,"Fout Vracht"]
[]
[]
[]
[]
[]
[]
[]
[]
[]
[]
[]
[null,"Opmerking"]
[null,"Het onderzoek vindt plaats gedurende coronamaatregelen."]
[null,"Dit heeft mogelijk een effect op de resultaten."]
[]
[null,"Toelichting"]
[null,"Pers = personenwagens op daarvoor bestemde"]
[null,"          openbare plaatsen"]
[null,"Vracht = vrachtwagens op daarvoor bestemde"]
[null,"          parkeerplaatsen (middel- en zwaar vrachtverkeer)"]
[null,"Motor = geparkeerde motoren op openbare plaatsen"]
[null,"Obstakel / overig = obstakels of overige voertuigen"]
[null,"          geparkeerd op openbare plaatsen"]
[null,"Fout pers = personenwagens die fout geparkeerd staan"]
[null,"Fout vracht = vrachtwagens die fout geparkeerd staan"]
[null,"E-wagen = geparkeerde elektrisch voertuig bij een"]
[null,"          elektrisch oplaadpunt"]
[null,"Invalide = personenwagens en motoren op voor"]
[null,"          invalide personen bestemde parkeerplaats"]
[null,"Gestalde fietsen = alle gestalde fietsen op de"]
[null,"          daarvoor bestemde parkeerplaatsen"]

{"sheet":"76.Wuustwezel","index":71,"n_rows":57,"n_cols":26,"rows_kept":57,"cut":false,"hidden":false,"merged":[[4,3,5,12],[4,16,5,16],[15,3,16,12]]}
[]
[null,"PARKEERONDERZOEK",null,"CARPOOLPARKINGS EN P+R PARKINGS"]
[null,76,null,{"$f":"B8 & \" - \"& TEXT(VLOOKUP(B3,Coordinaten!$A$2:$G$95,7,0),\"dddd dd mmmm jjjj\")","v":"Carpool parking Wuustwezel, Wuustwezel - donderdag 18 november 2021"}]
[null,{"$f":"VLOOKUP(B3,Coordinaten!$A$2:$G$95,6,0)","v":"51.408496, 4.612086"}]
[null,null,null,"BEZETTING  ",null,null,null,null,null,null,null,null,null,null,null,null,"OPMERKINGEN"]
[]
[null,"Onderzoeksgebied",null,"Datum","Geregistreerd tussen","Pers","Vracht","Motor","Obstakel / overig","Fout   pers","Fout Vracht","Totaal","E-wagen\nplaats","Invalidenplaats","Gestalde fietsen",null,null,null,null,null,{"$f":"F7","v":"Pers"},"Vracht","Motor","Obstakel / overig","Fout   pers","Fout Vracht"]
[null,{"$f":"VLOOKUP(B3,Coordinaten!$A$2:$G$95,3,0)&\", \"&VLOOKUP(B3,Coordinaten!$A$2:$G$95,5,0)","v":"Carpool parking Wuustwezel, Wuustwezel"},null,"2021-11-18","09:00 - 16:00u",7,0,0,0,11,0,18,0,0,0,null,0,null,{"$f":"D8","v":"2021-11-18"},{"$f":"E8","v":"09:00 - 16:00u"},{"$f":"IF(F8=0,NA(),F8/$L8)","v":0.3888888888888889},{"$f":"IF(G8=0,NA(),G8/$L8)","v":{"$error":"#N/A"}},{"$f":"IF(H8=0,NA(),H8/$L8)","v":{"$error":"#N/A"}},{"$error":"#N/A"},0.61111111111111116,{"$error":"#N/A"}]
[null,{"$f":"\"Nabij kruispunt: \"&VLOOKUP(B3,Coordinaten!$A$2:$L$95,4,0)","v":"Nabij kruispunt: N1 / N144"},null,null,null,0.3888888888888889,"-","-","-",0.61111111111111116,"-",1,null,null,null,null,0,null,{"$f":"D10","v":"2021-11-18"},{"$f":"E10","v":"19:00 - 02:00u"},{"$f":"IF(F10=0,NA(),F10/$L10)","v":1},{"$f":"IF(G10=0,NA(),G10/$L10)","v":{"$error":"#N/A"}},{"$error":"#N/A"},{"$error":"#N/A"},{"$error":"#N/A"},{"$error":"#N/A"}]
[null,null,null,"2021-11-18","19:00 - 02:00u",5,0,0,0,0,0,5,0,0,0,null,0]
[null,"Meting",null,null,null,1,"-","-","-","-","-",1,null,null,null,null,0]
[null,{"$f":"\"Meetperiode: \"&TEXT(VLOOKUP(B3,Coordinaten!$A$2:$G$95,7,0),\"dddd dd mmmm jjjj\")","v":"Meetperiode: donderdag 18 november 2021"}]
[null,"Methodiek: Parkeerdrukmeting met waarnemers"]
[null,"In opdracht van: Vlaamse overheid"]
[null,"Uitgevoerd door: Dufec"]
[null,null,null,"VERDELING NAAR CATEGORIE"]
[null,"Locatie"]
[null,{"$f":"IF(B4=\"\",\"\",HYPERLINK(\"http://www.googlemaps.com/?q=\"&B4,\"Lat/Long: \"&B4))","v":"Lat/Long: 51.408496, 4.612086"}]
[]
[null,null,null,null,null,null,null,null,null,null,null,null,null,null,null,"Legenda"]
[null,null,null,null,null,null,null,null,null,null,null,null,null,null,null,null,"Personenwagen"]
[null,null,null,null,null,null,null,null,null,null,null,null,null,null,null,null,"Vracht"]
[null,null,null,null,null,null,null,null,null,null,null,null,null,null,null,null,"Motor"]
[null,null,null,null,null,null,null,null,null,null,null,null,null,null,null,null,"Obstakel / overig"]
[null,null,null,null,null,null,null,null,null,null,null,null,null,null,null,null,"Fout personenwagen"]
[null,null,null,null,null,null,null,null,null,null,null,null,null,null,null,null,"Fout Vracht"]
[]
[]
[]
[]
[]
[]
[]
[]
[]
[]
[]
[null,"Opmerking"]
[null,"Het onderzoek vindt plaats gedurende coronamaatregelen."]
[null,"Dit heeft mogelijk een effect op de resultaten."]
[]
[null,"Toelichting"]
[null,"Pers = personenwagens op daarvoor bestemde"]
[null,"          openbare plaatsen"]
[null,"Vracht = vrachtwagens op daarvoor bestemde"]
[null,"          parkeerplaatsen (middel- en zwaar vrachtverkeer)"]
[null,"Motor = geparkeerde motoren op openbare plaatsen"]
[null,"Obstakel / overig = obstakels of overige voertuigen"]
[null,"          geparkeerd op openbare plaatsen"]
[null,"Fout pers = personenwagens die fout geparkeerd staan"]
[null,"Fout vracht = vrachtwagens die fout geparkeerd staan"]
[null,"E-wagen = geparkeerde elektrisch voertuig bij een"]
[null,"          elektrisch oplaadpunt"]
[null,"Invalide = personenwagens en motoren op voor"]
[null,"          invalide personen bestemde parkeerplaats"]
[null,"Gestalde fietsen = alle gestalde fietsen op de"]
[null,"          daarvoor bestemde parkeerplaatsen"]

{"sheet":"77.Keizershoek","index":72,"n_rows":57,"n_cols":26,"rows_kept":57,"cut":false,"hidden":false,"merged":[[4,3,5,12],[4,16,5,16],[15,3,16,12]]}
[]
[null,"PARKEERONDERZOEK",null,"CARPOOLPARKINGS EN P+R PARKINGS"]
[null,77,null,{"$f":"B8 & \" - \"& TEXT(VLOOKUP(B3,Coordinaten!$A$2:$G$95,7,0),\"dddd dd mmmm jjjj\")","v":"Carpool parking/P+R parking Keizershoek, Antwerpen - dinsdag 09 november 2021"}]
[null,{"$f":"VLOOKUP(B3,Coordinaten!$A$2:$G$95,6,0)","v":"51.258243, 4.461816"}]
[null,null,null,"BEZETTING  ",null,null,null,null,null,null,null,null,null,null,null,null,"OPMERKINGEN"]
[]
[null,"Onderzoeksgebied",null,"Datum","Geregistreerd tussen","Pers","Vracht","Motor","Obstakel / overig","Fout   pers","Fout Vracht","Totaal","E-wagen\nplaats","Invalidenplaats","Gestalde fietsen",null,null,null,null,null,{"$f":"F7","v":"Pers"},"Vracht","Motor","Obstakel / overig","Fout   pers","Fout Vracht"]
[null,{"$f":"VLOOKUP(B3,Coordinaten!$A$2:$G$95,3,0)&\", \"&VLOOKUP(B3,Coordinaten!$A$2:$G$95,5,0)","v":"Carpool parking/P+R parking Keizershoek, Antwerpen"},null,"2021-11-09","09:00 - 16:00u",18,0,0,0,0,1,19,0,0,0,null,0,null,{"$f":"D8","v":"2021-11-09"},{"$f":"E8","v":"09:00 - 16:00u"},{"$f":"IF(F8=0,NA(),F8/$L8)","v":0.94736842105263153},{"$f":"IF(G8=0,NA(),G8/$L8)","v":{"$error":"#N/A"}},{"$f":"IF(H8=0,NA(),H8/$L8)","v":{"$error":"#N/A"}},{"$error":"#N/A"},{"$error":"#N/A"},5.2631578947368418E-2]
[null,{"$f":"\"Nabij kruispunt: \"&VLOOKUP(B3,Coordinaten!$A$2:$L$95,4,0)","v":"Nabij kruispunt: N1 / Horstebaan"},null,null,null,0.94736842105263153,"-","-","-","-",5.2631578947368418E-2,1,null,null,null,null,0,null,{"$f":"D10","v":"2021-11-09"},{"$f":"E10","v":"19:00 - 02:00u"},{"$f":"IF(F10=0,NA(),F10/$L10)","v":0.82352941176470584},{"$f":"IF(G10=0,NA(),G10/$L10)","v":{"$error":"#N/A"}},{"$error":"#N/A"},{"$error":"#N/A"},{"$error":"#N/A"},0.17647058823529413]
[null,null,null,"2021-11-09","19:00 - 02:00u",14,0,0,0,0,3,17,0,0,0,null,0]
[null,"Meting",null,null,null,0.82352941176470584,"-","-","-","-",0.17647058823529413,1,null,null,null,null,0]
[null,{"$f":"\"Meetperiode: \"&TEXT(VLOOKUP(B3,Coordinaten!$A$2:$G$95,7,0),\"dddd dd mmmm jjjj\")","v":"Meetperiode: dinsdag 09 november 2021"}]
[null,"Methodiek: Parkeerdrukmeting met waarnemers"]
[null,"In opdracht van: Vlaamse overheid"]
[null,"Uitgevoerd door: Dufec"]
[null,null,null,"VERDELING NAAR CATEGORIE"]
[null,"Locatie"]
[null,{"$f":"IF(B4=\"\",\"\",HYPERLINK(\"http://www.googlemaps.com/?q=\"&B4,\"Lat/Long: \"&B4))","v":"Lat/Long: 51.258243, 4.461816"}]
[]
[null,null,null,null,null,null,null,null,null,null,null,null,null,null,null,"Legenda"]
[null,null,null,null,null,null,null,null,null,null,null,null,null,null,null,null,"Personenwagen"]
[null,null,null,null,null,null,null,null,null,null,null,null,null,null,null,null,"Vracht"]
[null,null,null,null,null,null,null,null,null,null,null,null,null,null,null,null,"Motor"]
[null,null,null,null,null,null,null,null,null,null,null,null,null,null,null,null,"Obstakel / overig"]
[null,null,null,null,null,null,null,null,null,null,null,null,null,null,null,null,"Fout personenwagen"]
[null,null,null,null,null,null,null,null,null,null,null,null,null,null,null,null,"Fout Vracht"]
[]
[]
[]
[]
[]
[]
[]
[]
[]
[]
[]
[null,"Opmerking"]
[null,"Het onderzoek vindt plaats gedurende coronamaatregelen."]
[null,"Dit heeft mogelijk een effect op de resultaten."]
[]
[null,"Toelichting"]
[null,"Pers = personenwagens op daarvoor bestemde"]
[null,"          openbare plaatsen"]
[null,"Vracht = vrachtwagens op daarvoor bestemde"]
[null,"          parkeerplaatsen (middel- en zwaar vrachtverkeer)"]
[null,"Motor = geparkeerde motoren op openbare plaatsen"]
[null,"Obstakel / overig = obstakels of overige voertuigen"]
[null,"          geparkeerd op openbare plaatsen"]
[null,"Fout pers = personenwagens die fout geparkeerd staan"]
[null,"Fout vracht = vrachtwagens die fout geparkeerd staan"]
[null,"E-wagen = geparkeerde elektrisch voertuig bij een"]
[null,"          elektrisch oplaadpunt"]
[null,"Invalide = personenwagens en motoren op voor"]
[null,"          invalide personen bestemde parkeerplaats"]
[null,"Gestalde fietsen = alle gestalde fietsen op de"]
[null,"          daarvoor bestemde parkeerplaatsen"]

{"sheet":"78.Blancefloerlaan","index":73,"n_rows":57,"n_cols":26,"rows_kept":57,"cut":false,"hidden":false,"merged":[[4,3,5,12],[4,16,5,16],[15,3,16,12]]}
[]
[null,"PARKEERONDERZOEK",null,"CARPOOLPARKINGS EN P+R PARKINGS"]
[null,78,null,{"$f":"B8 & \" - \"& TEXT(VLOOKUP(B3,Coordinaten!$A$2:$G$95,7,0),\"dddd dd mmmm jjjj\")","v":"Carpool parking Blancefloerlaan, Antwerpen - dinsdag 09 november 2021"}]
[null,{"$f":"VLOOKUP(B3,Coordinaten!$A$2:$G$95,6,0)","v":"51.219428, 4.347431"}]
[null,null,null,"BEZETTING  ",null,null,null,null,null,null,null,null,null,null,null,null,"OPMERKINGEN"]
[]
[null,"Onderzoeksgebied",null,"Datum","Geregistreerd tussen","Pers","Vracht","Motor","Obstakel / overig","Fout   pers","Fout Vracht","Totaal","E-wagen\nplaats","Invalidenplaats","Gestalde fietsen",null,null,null,null,null,{"$f":"F7","v":"Pers"},"Vracht","Motor","Obstakel / overig","Fout   pers","Fout Vracht"]
[null,{"$f":"VLOOKUP(B3,Coordinaten!$A$2:$G$95,3,0)&\", \"&VLOOKUP(B3,Coordinaten!$A$2:$G$95,5,0)","v":"Carpool parking Blancefloerlaan, Antwerpen"},null,"2021-11-09","09:00 - 16:00u",258,0,0,0,15,0,273,0,0,0,null,0,null,{"$f":"D8","v":"2021-11-09"},{"$f":"E8","v":"09:00 - 16:00u"},{"$f":"IF(F8=0,NA(),F8/$L8)","v":0.94505494505494503},{"$f":"IF(G8=0,NA(),G8/$L8)","v":{"$error":"#N/A"}},{"$f":"IF(H8=0,NA(),H8/$L8)","v":{"$error":"#N/A"}},{"$error":"#N/A"},5.4945054945054944E-2,{"$error":"#N/A"}]
[null,{"$f":"\"Nabij kruispunt: \"&VLOOKUP(B3,Coordinaten!$A$2:$L$95,4,0)","v":"Nabij kruispunt: R1 / N70"},null,null,null,0.94505494505494503,"-","-","-",5.4945054945054944E-2,"-",1,null,null,null,null,0,null,{"$f":"D10","v":"2021-11-09"},{"$f":"E10","v":"19:00 - 02:00u"},{"$f":"IF(F10=0,NA(),F10/$L10)","v":0.97916666666666663},{"$f":"IF(G10=0,NA(),G10/$L10)","v":{"$error":"#N/A"}},{"$error":"#N/A"},{"$error":"#N/A"},2.0833333333333332E-2,{"$error":"#N/A"}]
[null,null,null,"2021-11-09","19:00 - 02:00u",141,0,0,0,3,0,144,0,0,0,null,0]
[null,"Meting",null,null,null,0.97916666666666663,"-","-","-",2.0833333333333332E-2,"-",1,null,null,null,null,0]
[null,{"$f":"\"Meetperiode: \"&TEXT(VLOOKUP(B3,Coordinaten!$A$2:$G$95,7,0),\"dddd dd mmmm jjjj\")","v":"Meetperiode: dinsdag 09 november 2021"}]
[null,"Methodiek: Parkeerdrukmeting met waarnemers"]
[null,"In opdracht van: Vlaamse overheid"]
[null,"Uitgevoerd door: Dufec"]
[null,null,null,"VERDELING NAAR CATEGORIE"]
[null,"Locatie"]
[null,{"$f":"IF(B4=\"\",\"\",HYPERLINK(\"http://www.googlemaps.com/?q=\"&B4,\"Lat/Long: \"&B4))","v":"Lat/Long: 51.219428, 4.347431"}]
[]
[null,null,null,null,null,null,null,null,null,null,null,null,null,null,null,"Legenda"]
[null,null,null,null,null,null,null,null,null,null,null,null,null,null,null,null,"Personenwagen"]
[null,null,null,null,null,null,null,null,null,null,null,null,null,null,null,null,"Vracht"]
[null,null,null,null,null,null,null,null,null,null,null,null,null,null,null,null,"Motor"]
[null,null,null,null,null,null,null,null,null,null,null,null,null,null,null,null,"Obstakel / overig"]
[null,null,null,null,null,null,null,null,null,null,null,null,null,null,null,null,"Fout personenwagen"]
[null,null,null,null,null,null,null,null,null,null,null,null,null,null,null,null,"Fout Vracht"]
[]
[]
[]
[]
[]
[]
[]
[]
[]
[]
[]
[null,"Opmerking"]
[null,"Het onderzoek vindt plaats gedurende coronamaatregelen."]
[null,"Dit heeft mogelijk een effect op de resultaten."]
[]
[null,"Toelichting"]
[null,"Pers = personenwagens op daarvoor bestemde"]
[null,"          openbare plaatsen"]
[null,"Vracht = vrachtwagens op daarvoor bestemde"]
[null,"          parkeerplaatsen (middel- en zwaar vrachtverkeer)"]
[null,"Motor = geparkeerde motoren op openbare plaatsen"]
[null,"Obstakel / overig = obstakels of overige voertuigen"]
[null,"          geparkeerd op openbare plaatsen"]
[null,"Fout pers = personenwagens die fout geparkeerd staan"]
[null,"Fout vracht = vrachtwagens die fout geparkeerd staan"]
[null,"E-wagen = geparkeerde elektrisch voertuig bij een"]
[null,"          elektrisch oplaadpunt"]
[null,"Invalide = personenwagens en motoren op voor"]
[null,"          invalide personen bestemde parkeerplaats"]
[null,"Gestalde fietsen = alle gestalde fietsen op de"]
[null,"          daarvoor bestemde parkeerplaatsen"]

{"sheet":"81.Rotselaar","index":74,"n_rows":57,"n_cols":26,"rows_kept":57,"cut":false,"hidden":false,"merged":[[4,3,5,12],[4,16,5,16],[15,3,16,12]]}
[]
[null,"PARKEERONDERZOEK",null,"CARPOOLPARKINGS EN P+R PARKINGS"]
[null,81,null,{"$f":"B8 & \" - \"& TEXT(VLOOKUP(B3,Coordinaten!$A$2:$G$95,7,0),\"dddd dd mmmm jjjj\")","v":"Carpool parking Rotselaar, Rotselaar - dinsdag 16 november 2021"}]
[null,{"$f":"VLOOKUP(B3,Coordinaten!$A$2:$G$95,6,0)","v":"50.938803, 4.736643"}]
[null,null,null,"BEZETTING  ",null,null,null,null,null,null,null,null,null,null,null,null,"OPMERKINGEN"]
[]
[null,"Onderzoeksgebied",null,"Datum","Geregistreerd tussen","Pers","Vracht","Motor","Obstakel / overig","Fout   pers","Fout Vracht","Totaal","E-wagen\nplaats","Invalidenplaats","Gestalde fietsen",null,null,null,null,null,{"$f":"F7","v":"Pers"},"Vracht","Motor","Obstakel / overig","Fout   pers","Fout Vracht"]
[null,{"$f":"VLOOKUP(B3,Coordinaten!$A$2:$G$95,3,0)&\", \"&VLOOKUP(B3,Coordinaten!$A$2:$G$95,5,0)","v":"Carpool parking Rotselaar, Rotselaar"},null,"2021-11-16","09:00 - 16:00u",33,0,0,1,0,1,35,1,1,17,null,"Obstakel: aanhanger",null,{"$f":"D8","v":"2021-11-16"},{"$f":"E8","v":"09:00 - 16:00u"},{"$f":"IF(F8=0,NA(),F8/$L8)","v":0.94285714285714284},{"$f":"IF(G8=0,NA(),G8/$L8)","v":{"$error":"#N/A"}},{"$f":"IF(H8=0,NA(),H8/$L8)","v":{"$error":"#N/A"}},2.8571428571428571E-2,{"$error":"#N/A"},2.8571428571428571E-2]
[null,{"$f":"\"Nabij kruispunt: \"&VLOOKUP(B3,Coordinaten!$A$2:$L$95,4,0)","v":"Nabij kruispunt: N19 / N229"},null,null,null,0.94285714285714284,"-","-",2.8571428571428571E-2,"-",2.8571428571428571E-2,1,null,null,null,null,0,null,{"$f":"D10","v":"2021-11-16"},{"$f":"E10","v":"19:00 - 02:00u"},{"$f":"IF(F10=0,NA(),F10/$L10)","v":0.89473684210526316},{"$f":"IF(G10=0,NA(),G10/$L10)","v":{"$error":"#N/A"}},{"$error":"#N/A"},{"$error":"#N/A"},{"$error":"#N/A"},0.10526315789473684]
[null,null,null,"2021-11-16","19:00 - 02:00u",17,0,0,0,0,2,19,0,0,0,null,0]
[null,"Meting",null,null,null,0.89473684210526316,"-","-","-","-",0.10526315789473684,1,null,null,null,null,0]
[null,{"$f":"\"Meetperiode: \"&TEXT(VLOOKUP(B3,Coordinaten!$A$2:$G$95,7,0),\"dddd dd mmmm jjjj\")","v":"Meetperiode: dinsdag 16 november 2021"}]
[null,"Methodiek: Parkeerdrukmeting met waarnemers"]
[null,"In opdracht van: Vlaamse overheid"]
[null,"Uitgevoerd door: Dufec"]
[null,null,null,"VERDELING NAAR CATEGORIE"]
[null,"Locatie"]
[null,{"$f":"IF(B4=\"\",\"\",HYPERLINK(\"http://www.googlemaps.com/?q=\"&B4,\"Lat/Long: \"&B4))","v":"Lat/Long: 50.938803, 4.736643"}]
[]
[null,null,null,null,null,null,null,null,null,null,null,null,null,null,null,"Legenda"]
[null,null,null,null,null,null,null,null,null,null,null,null,null,null,null,null,"Personenwagen"]
[null,null,null,null,null,null,null,null,null,null,null,null,null,null,null,null,"Vracht"]
[null,null,null,null,null,null,null,null,null,null,null,null,null,null,null,null,"Motor"]
[null,null,null,null,null,null,null,null,null,null,null,null,null,null,null,null,"Obstakel / overig"]
[null,null,null,null,null,null,null,null,null,null,null,null,null,null,null,null,"Fout personenwagen"]
[null,null,null,null,null,null,null,null,null,null,null,null,null,null,null,null,"Fout Vracht"]
[]
[]
[]
[]
[]
[]
[]
[]
[]
[]
[]
[null,"Opmerking"]
[null,"Het onderzoek vindt plaats gedurende coronamaatregelen."]
[null,"Dit heeft mogelijk een effect op de resultaten."]
[]
[null,"Toelichting"]
[null,"Pers = personenwagens op daarvoor bestemde"]
[null,"          openbare plaatsen"]
[null,"Vracht = vrachtwagens op daarvoor bestemde"]
[null,"          parkeerplaatsen (middel- en zwaar vrachtverkeer)"]
[null,"Motor = geparkeerde motoren op openbare plaatsen"]
[null,"Obstakel / overig = obstakels of overige voertuigen"]
[null,"          geparkeerd op openbare plaatsen"]
[null,"Fout pers = personenwagens die fout geparkeerd staan"]
[null,"Fout vracht = vrachtwagens die fout geparkeerd staan"]
[null,"E-wagen = geparkeerde elektrisch voertuig bij een"]
[null,"          elektrisch oplaadpunt"]
[null,"Invalide = personenwagens en motoren op voor"]
[null,"          invalide personen bestemde parkeerplaats"]
[null,"Gestalde fietsen = alle gestalde fietsen op de"]
[null,"          daarvoor bestemde parkeerplaatsen"]

{"sheet":"82.Vuntcomplex","index":75,"n_rows":57,"n_cols":26,"rows_kept":57,"cut":false,"hidden":false,"merged":[[4,3,5,12],[4,16,5,16],[15,3,16,12]]}
[]
[null,"PARKEERONDERZOEK",null,"CARPOOLPARKINGS EN P+R PARKINGS"]
[null,82,null,{"$f":"B8 & \" - \"& TEXT(VLOOKUP(B3,Coordinaten!$A$2:$G$95,7,0),\"dddd dd mmmm jjjj\")","v":"Carpool parking Vuntcomplex, Leuven - dinsdag 16 november 2021"}]
[null,{"$f":"VLOOKUP(B3,Coordinaten!$A$2:$G$95,6,0)","v":"50.906947, 4.716171"}]
[null,null,null,"BEZETTING  ",null,null,null,null,null,null,null,null,null,null,null,null,"OPMERKINGEN"]
[]
[null,"Onderzoeksgebied",null,"Datum","Geregistreerd tussen","Pers","Vracht","Motor","Obstakel / overig","Fout   pers","Fout Vracht","Totaal","E-wagen\nplaats","Invalidenplaats","Gestalde fietsen",null,null,null,null,null,{"$f":"F7","v":"Pers"},"Vracht","Motor","Obstakel / overig","Fout   pers","Fout Vracht"]
[null,{"$f":"VLOOKUP(B3,Coordinaten!$A$2:$G$95,3,0)&\", \"&VLOOKUP(B3,Coordinaten!$A$2:$G$95,5,0)","v":"Carpool parking Vuntcomplex, Leuven"},null,"2021-11-16","09:00 - 16:00u",12,0,0,0,0,0,12,0,0,1,null,0,null,{"$f":"D8","v":"2021-11-16"},{"$f":"E8","v":"09:00 - 16:00u"},{"$f":"IF(F8=0,NA(),F8/$L8)","v":1},{"$f":"IF(G8=0,NA(),G8/$L8)","v":{"$error":"#N/A"}},{"$f":"IF(H8=0,NA(),H8/$L8)","v":{"$error":"#N/A"}},{"$error":"#N/A"},{"$error":"#N/A"},{"$error":"#N/A"}]
[null,{"$f":"\"Nabij kruispunt: \"&VLOOKUP(B3,Coordinaten!$A$2:$L$95,4,0)","v":"Nabij kruispunt: A2 / Vuntcomplex"},null,null,null,1,"-","-","-","-","-",1,null,null,null,null,0,null,{"$f":"D10","v":"2021-11-16"},{"$f":"E10","v":"19:00 - 02:00u"},{"$f":"IF(F10=0,NA(),F10/$L10)","v":0.8},{"$f":"IF(G10=0,NA(),G10/$L10)","v":{"$error":"#N/A"}},{"$error":"#N/A"},{"$error":"#N/A"},{"$error":"#N/A"},0.2]
[null,null,null,"2021-11-16","19:00 - 02:00u",4,0,0,0,0,1,5,0,0,11,null,0]
[null,"Meting",null,null,null,0.8,"-","-","-","-",0.2,1,null,null,null,null,0]
[null,{"$f":"\"Meetperiode: \"&TEXT(VLOOKUP(B3,Coordinaten!$A$2:$G$95,7,0),\"dddd dd mmmm jjjj\")","v":"Meetperiode: dinsdag 16 november 2021"}]
[null,"Methodiek: Parkeerdrukmeting met waarnemers"]
[null,"In opdracht van: Vlaamse overheid"]
[null,"Uitgevoerd door: Dufec"]
[null,null,null,"VERDELING NAAR CATEGORIE"]
[null,"Locatie"]
[null,{"$f":"IF(B4=\"\",\"\",HYPERLINK(\"http://www.googlemaps.com/?q=\"&B4,\"Lat/Long: \"&B4))","v":"Lat/Long: 50.906947, 4.716171"}]
[]
[null,null,null,null,null,null,null,null,null,null,null,null,null,null,null,"Legenda"]
[null,null,null,null,null,null,null,null,null,null,null,null,null,null,null,null,"Personenwagen"]
[null,null,null,null,null,null,null,null,null,null,null,null,null,null,null,null,"Vracht"]
[null,null,null,null,null,null,null,null,null,null,null,null,null,null,null,null,"Motor"]
[null,null,null,null,null,null,null,null,null,null,null,null,null,null,null,null,"Obstakel / overig"]
[null,null,null,null,null,null,null,null,null,null,null,null,null,null,null,null,"Fout personenwagen"]
[null,null,null,null,null,null,null,null,null,null,null,null,null,null,null,null,"Fout Vracht"]
[]
[]
[]
[]
[]
[]
[]
[]
[]
[]
[]
[null,"Opmerking"]
[null,"Het onderzoek vindt plaats gedurende coronamaatregelen."]
[null,"Dit heeft mogelijk een effect op de resultaten."]
[]
[null,"Toelichting"]
[null,"Pers = personenwagens op daarvoor bestemde"]
[null,"          openbare plaatsen"]
[null,"Vracht = vrachtwagens op daarvoor bestemde"]
[null,"          parkeerplaatsen (middel- en zwaar vrachtverkeer)"]
[null,"Motor = geparkeerde motoren op openbare plaatsen"]
[null,"Obstakel / overig = obstakels of overige voertuigen"]
[null,"          geparkeerd op openbare plaatsen"]
[null,"Fout pers = personenwagens die fout geparkeerd staan"]
[null,"Fout vracht = vrachtwagens die fout geparkeerd staan"]
[null,"E-wagen = geparkeerde elektrisch voertuig bij een"]
[null,"          elektrisch oplaadpunt"]
[null,"Invalide = personenwagens en motoren op voor"]
[null,"          invalide personen bestemde parkeerplaats"]
[null,"Gestalde fietsen = alle gestalde fietsen op de"]
[null,"          daarvoor bestemde parkeerplaatsen"]

{"sheet":"83.Sterrebeek","index":76,"n_rows":57,"n_cols":26,"rows_kept":57,"cut":false,"hidden":false,"merged":[[4,3,5,12],[4,16,5,16],[15,3,16,12]]}
[]
[null,"PARKEERONDERZOEK",null,"CARPOOLPARKINGS EN P+R PARKINGS"]
[null,83,null,{"$f":"B8 & \" - \"& TEXT(VLOOKUP(B3,Coordinaten!$A$2:$G$95,7,0),\"dddd dd mmmm jjjj\")","v":"Carpool parking Sterrebeek, Zaventem - donderdag 18 november 2021"}]
[null,{"$f":"VLOOKUP(B3,Coordinaten!$A$2:$G$95,6,0)","v":"50.871388, 4.510603"}]
[null,null,null,"BEZETTING  ",null,null,null,null,null,null,null,null,null,null,null,null,"OPMERKINGEN"]
[]
[null,"Onderzoeksgebied",null,"Datum","Geregistreerd tussen","Pers","Vracht","Motor","Obstakel / overig","Fout   pers","Fout Vracht","Totaal","E-wagen\nplaats","Invalidenplaats","Gestalde fietsen",null,null,null,null,null,{"$f":"F7","v":"Pers"},"Vracht","Motor","Obstakel / overig","Fout   pers","Fout Vracht"]
[null,{"$f":"VLOOKUP(B3,Coordinaten!$A$2:$G$95,3,0)&\", \"&VLOOKUP(B3,Coordinaten!$A$2:$G$95,5,0)","v":"Carpool parking Sterrebeek, Zaventem"},null,"2021-11-18","09:00 - 16:00u",22,0,0,0,0,0,22,0,0,0,null,0,null,{"$f":"D8","v":"2021-11-18"},{"$f":"E8","v":"09:00 - 16:00u"},{"$f":"IF(F8=0,NA(),F8/$L8)","v":1},{"$f":"IF(G8=0,NA(),G8/$L8)","v":{"$error":"#N/A"}},{"$f":"IF(H8=0,NA(),H8/$L8)","v":{"$error":"#N/A"}},{"$error":"#N/A"},{"$error":"#N/A"},{"$error":"#N/A"}]
[null,{"$f":"\"Nabij kruispunt: \"&VLOOKUP(B3,Coordinaten!$A$2:$L$95,4,0)","v":"Nabij kruispunt: N227 / A3"},null,null,null,1,"-","-","-","-","-",1,null,null,null,null,0,null,{"$f":"D10","v":"2021-11-18"},{"$f":"E10","v":"19:00 - 02:00u"},{"$f":"IF(F10=0,NA(),F10/$L10)","v":1},{"$f":"IF(G10=0,NA(),G10/$L10)","v":{"$error":"#N/A"}},{"$error":"#N/A"},{"$error":"#N/A"},{"$error":"#N/A"},{"$error":"#N/A"}]
[null,null,null,"2021-11-18","19:00 - 02:00u",13,0,0,0,0,0,13,0,0,0,null,0]
[null,"Meting",null,null,null,1,"-","-","-","-","-",1,null,null,null,null,0]
[null,{"$f":"\"Meetperiode: \"&TEXT(VLOOKUP(B3,Coordinaten!$A$2:$G$95,7,0),\"dddd dd mmmm jjjj\")","v":"Meetperiode: donderdag 18 november 2021"}]
[null,"Methodiek: Parkeerdrukmeting met waarnemers"]
[null,"In opdracht van: Vlaamse overheid"]
[null,"Uitgevoerd door: Dufec"]
[null,null,null,"VERDELING NAAR CATEGORIE"]
[null,"Locatie"]
[null,{"$f":"IF(B4=\"\",\"\",HYPERLINK(\"http://www.googlemaps.com/?q=\"&B4,\"Lat/Long: \"&B4))","v":"Lat/Long: 50.871388, 4.510603"}]
[]
[null,null,null,null,null,null,null,null,null,null,null,null,null,null,null,"Legenda"]
[null,null,null,null,null,null,null,null,null,null,null,null,null,null,null,null,"Personenwagen"]
[null,null,null,null,null,null,null,null,null,null,null,null,null,null,null,null,"Vracht"]
[null,null,null,null,null,null,null,null,null,null,null,null,null,null,null,null,"Motor"]
[null,null,null,null,null,null,null,null,null,null,null,null,null,null,null,null,"Obstakel / overig"]
[null,null,null,null,null,null,null,null,null,null,null,null,null,null,null,null,"Fout personenwagen"]
[null,null,null,null,null,null,null,null,null,null,null,null,null,null,null,null,"Fout Vracht"]
[]
[]
[]
[]
[]
[]
[]
[]
[]
[]
[]
[null,"Opmerking"]
[null,"Het onderzoek vindt plaats gedurende coronamaatregelen."]
[null,"Dit heeft mogelijk een effect op de resultaten."]
[]
[null,"Toelichting"]
[null,"Pers = personenwagens op daarvoor bestemde"]
[null,"          openbare plaatsen"]
[null,"Vracht = vrachtwagens op daarvoor bestemde"]
[null,"          parkeerplaatsen (middel- en zwaar vrachtverkeer)"]
[null,"Motor = geparkeerde motoren op openbare plaatsen"]
[null,"Obstakel / overig = obstakels of overige voertuigen"]
[null,"          geparkeerd op openbare plaatsen"]
[null,"Fout pers = personenwagens die fout geparkeerd staan"]
[null,"Fout vracht = vrachtwagens die fout geparkeerd staan"]
[null,"E-wagen = geparkeerde elektrisch voertuig bij een"]
[null,"          elektrisch oplaadpunt"]
[null,"Invalide = personenwagens en motoren op voor"]
[null,"          invalide personen bestemde parkeerplaats"]
[null,"Gestalde fietsen = alle gestalde fietsen op de"]
[null,"          daarvoor bestemde parkeerplaatsen"]

{"sheet":"84.Halle-Rattenput","index":77,"n_rows":57,"n_cols":26,"rows_kept":57,"cut":false,"hidden":false,"merged":[[4,3,5,12],[4,16,5,16],[15,3,16,12]]}
[]
[null,"PARKEERONDERZOEK",null,"CARPOOLPARKINGS EN P+R PARKINGS"]
[null,84,null,{"$f":"B8 & \" - \"& TEXT(VLOOKUP(B3,Coordinaten!$A$2:$G$95,7,0),\"dddd dd mmmm jjjj\")","v":"Carpool parking Halle-Rattenput, Halle - dinsdag 23 november 2021"}]
[null,{"$f":"VLOOKUP(B3,Coordinaten!$A$2:$G$95,6,0)","v":"50.723963, 4.227925"}]
[null,null,null,"BEZETTING  ",null,null,null,null,null,null,null,null,null,null,null,null,"OPMERKINGEN"]
[]
[null,"Onderzoeksgebied",null,"Datum","Geregistreerd tussen","Pers","Vracht","Motor","Obstakel / overig","Fout   pers","Fout Vracht","Totaal","E-wagen\nplaats","Invalidenplaats","Gestalde fietsen",null,null,null,null,null,{"$f":"F7","v":"Pers"},"Vracht","Motor","Obstakel / overig","Fout   pers","Fout Vracht"]
[null,{"$f":"VLOOKUP(B3,Coordinaten!$A$2:$G$95,3,0)&\", \"&VLOOKUP(B3,Coordinaten!$A$2:$G$95,5,0)","v":"Carpool parking Halle-Rattenput, Halle"},null,"2021-11-23","09:00 - 16:00u",3,0,0,2,0,0,5,0,0,0,null,"Vanaf 20 november nieuwe coronamaatregelen, waaronder verplicht telewerk",null,{"$f":"D8","v":"2021-11-23"},{"$f":"E8","v":"09:00 - 16:00u"},{"$f":"IF(F8=0,NA(),F8/$L8)","v":0.6},{"$f":"IF(G8=0,NA(),G8/$L8)","v":{"$error":"#N/A"}},{"$f":"IF(H8=0,NA(),H8/$L8)","v":{"$error":"#N/A"}},0.4,{"$error":"#N/A"},{"$error":"#N/A"}]
[null,{"$f":"\"Nabij kruispunt: \"&VLOOKUP(B3,Coordinaten!$A$2:$L$95,4,0)","v":"Nabij kruispunt: N6 / A8"},null,null,null,0.6,"-","-",0.4,"-","-",1,null,null,null,null,"Obstakel 2 aanhangers",null,{"$f":"D10","v":"2021-11-23"},{"$f":"E10","v":"19:00 - 02:00u"},{"$f":"IF(F10=0,NA(),F10/$L10)","v":1},{"$f":"IF(G10=0,NA(),G10/$L10)","v":{"$error":"#N/A"}},{"$error":"#N/A"},{"$error":"#N/A"},{"$error":"#N/A"},{"$error":"#N/A"}]
[null,null,null,"2021-11-23","19:00 - 02:00u",20,0,0,0,0,0,20,0,0,1,null,"Vanaf 20 november nieuwe coronamaatregelen, waaronder verplicht telewerk"]
[null,"Meting",null,null,null,1,"-","-","-","-","-",1,null,null,null,null,0]
[null,{"$f":"\"Meetperiode: \"&TEXT(VLOOKUP(B3,Coordinaten!$A$2:$G$95,7,0),\"dddd dd mmmm jjjj\")","v":"Meetperiode: dinsdag 23 november 2021"}]
[null,"Methodiek: Parkeerdrukmeting met waarnemers"]
[null,"In opdracht van: Vlaamse overheid"]
[null,"Uitgevoerd door: Dufec"]
[null,null,null,"VERDELING NAAR CATEGORIE"]
[null,"Locatie"]
[null,{"$f":"IF(B4=\"\",\"\",HYPERLINK(\"http://www.googlemaps.com/?q=\"&B4,\"Lat/Long: \"&B4))","v":"Lat/Long: 50.723963, 4.227925"}]
[]
[null,null,null,null,null,null,null,null,null,null,null,null,null,null,null,"Legenda"]
[null,null,null,null,null,null,null,null,null,null,null,null,null,null,null,null,"Personenwagen"]
[null,null,null,null,null,null,null,null,null,null,null,null,null,null,null,null,"Vracht"]
[null,null,null,null,null,null,null,null,null,null,null,null,null,null,null,null,"Motor"]
[null,null,null,null,null,null,null,null,null,null,null,null,null,null,null,null,"Obstakel / overig"]
[null,null,null,null,null,null,null,null,null,null,null,null,null,null,null,null,"Fout personenwagen"]
[null,null,null,null,null,null,null,null,null,null,null,null,null,null,null,null,"Fout Vracht"]
[]
[]
[]
[]
[]
[]
[]
[]
[]
[]
[]
[null,"Opmerking"]
[null,"Het onderzoek vindt plaats gedurende coronamaatregelen."]
[null,"Dit heeft mogelijk een effect op de resultaten."]
[]
[null,"Toelichting"]
[null,"Pers = personenwagens op daarvoor bestemde"]
[null,"          openbare plaatsen"]
[null,"Vracht = vrachtwagens op daarvoor bestemde"]
[null,"          parkeerplaatsen (middel- en zwaar vrachtverkeer)"]
[null,"Motor = geparkeerde motoren op openbare plaatsen"]
[null,"Obstakel / overig = obstakels of overige voertuigen"]
[null,"          geparkeerd op openbare plaatsen"]
[null,"Fout pers = personenwagens die fout geparkeerd staan"]
[null,"Fout vracht = vrachtwagens die fout geparkeerd staan"]
[null,"E-wagen = geparkeerde elektrisch voertuig bij een"]
[null,"          elektrisch oplaadpunt"]
[null,"Invalide = personenwagens en motoren op voor"]
[null,"          invalide personen bestemde parkeerplaats"]
[null,"Gestalde fietsen = alle gestalde fietsen op de"]
[null,"          daarvoor bestemde parkeerplaatsen"]

{"sheet":"85.Strombeek-Bever","index":78,"n_rows":57,"n_cols":26,"rows_kept":57,"cut":false,"hidden":false,"merged":[[4,3,5,12],[4,16,5,16],[15,3,16,12]]}
[]
[null,"PARKEERONDERZOEK",null,"CARPOOLPARKINGS EN P+R PARKINGS"]
[null,85,null,{"$f":"B8 & \" - \"& TEXT(VLOOKUP(B3,Coordinaten!$A$2:$G$95,7,0),\"dddd dd mmmm jjjj\")","v":"Carpool parking Strombeek-Bever, Grimbergen - donderdag 18 november 2021"}]
[null,{"$f":"VLOOKUP(B3,Coordinaten!$A$2:$G$95,6,0)","v":"50.903140, 4.346976"}]
[null,null,null,"BEZETTING  ",null,null,null,null,null,null,null,null,null,null,null,null,"OPMERKINGEN"]
[]
[null,"Onderzoeksgebied",null,"Datum","Geregistreerd tussen","Pers","Vracht","Motor","Obstakel / overig","Fout   pers","Fout Vracht","Totaal","E-wagen\nplaats","Invalidenplaats","Gestalde fietsen",null,null,null,null,null,{"$f":"F7","v":"Pers"},"Vracht","Motor","Obstakel / overig","Fout   pers","Fout Vracht"]
[null,{"$f":"VLOOKUP(B3,Coordinaten!$A$2:$G$95,3,0)&\", \"&VLOOKUP(B3,Coordinaten!$A$2:$G$95,5,0)","v":"Carpool parking Strombeek-Bever, Grimbergen"},null,"2021-11-18","09:00 - 16:00u",21,0,0,0,1,0,22,0,0,0,null,0,null,{"$f":"D8","v":"2021-11-18"},{"$f":"E8","v":"09:00 - 16:00u"},{"$f":"IF(F8=0,NA(),F8/$L8)","v":0.95454545454545459},{"$f":"IF(G8=0,NA(),G8/$L8)","v":{"$error":"#N/A"}},{"$f":"IF(H8=0,NA(),H8/$L8)","v":{"$error":"#N/A"}},{"$error":"#N/A"},4.5454545454545456E-2,{"$error":"#N/A"}]
[null,{"$f":"\"Nabij kruispunt: \"&VLOOKUP(B3,Coordinaten!$A$2:$L$95,4,0)","v":"Nabij kruispunt: N276 / Nieuwelaan"},null,null,null,0.95454545454545459,"-","-","-",4.5454545454545456E-2,"-",1,null,null,null,null,0,null,{"$f":"D10","v":"2021-11-18"},{"$f":"E10","v":"19:00 - 02:00u"},{"$f":"IF(F10=0,NA(),F10/$L10)","v":0.94736842105263153},{"$f":"IF(G10=0,NA(),G10/$L10)","v":{"$error":"#N/A"}},{"$error":"#N/A"},{"$error":"#N/A"},{"$error":"#N/A"},5.2631578947368418E-2]
[null,null,null,"2021-11-18","19:00 - 02:00u",18,0,0,0,0,1,19,0,0,0,null,0]
[null,"Meting",null,null,null,0.94736842105263153,"-","-","-","-",5.2631578947368418E-2,1,null,null,null,null,0]
[null,{"$f":"\"Meetperiode: \"&TEXT(VLOOKUP(B3,Coordinaten!$A$2:$G$95,7,0),\"dddd dd mmmm jjjj\")","v":"Meetperiode: donderdag 18 november 2021"}]
[null,"Methodiek: Parkeerdrukmeting met waarnemers"]
[null,"In opdracht van: Vlaamse overheid"]
[null,"Uitgevoerd door: Dufec"]
[null,null,null,"VERDELING NAAR CATEGORIE"]
[null,"Locatie"]
[null,{"$f":"IF(B4=\"\",\"\",HYPERLINK(\"http://www.googlemaps.com/?q=\"&B4,\"Lat/Long: \"&B4))","v":"Lat/Long: 50.903140, 4.346976"}]
[]
[null,null,null,null,null,null,null,null,null,null,null,null,null,null,null,"Legenda"]
[null,null,null,null,null,null,null,null,null,null,null,null,null,null,null,null,"Personenwagen"]
[null,null,null,null,null,null,null,null,null,null,null,null,null,null,null,null,"Vracht"]
[null,null,null,null,null,null,null,null,null,null,null,null,null,null,null,null,"Motor"]
[null,null,null,null,null,null,null,null,null,null,null,null,null,null,null,null,"Obstakel / overig"]
[null,null,null,null,null,null,null,null,null,null,null,null,null,null,null,null,"Fout personenwagen"]
[null,null,null,null,null,null,null,null,null,null,null,null,null,null,null,null,"Fout Vracht"]
[]
[]
[]
[]
[]
[]
[]
[]
[]
[]
[]
[null,"Opmerking"]
[null,"Het onderzoek vindt plaats gedurende coronamaatregelen."]
[null,"Dit heeft mogelijk een effect op de resultaten."]
[]
[null,"Toelichting"]
[null,"Pers = personenwagens op daarvoor bestemde"]
[null,"          openbare plaatsen"]
[null,"Vracht = vrachtwagens op daarvoor bestemde"]
[null,"          parkeerplaatsen (middel- en zwaar vrachtverkeer)"]
[null,"Motor = geparkeerde motoren op openbare plaatsen"]
[null,"Obstakel / overig = obstakels of overige voertuigen"]
[null,"          geparkeerd op openbare plaatsen"]
[null,"Fout pers = personenwagens die fout geparkeerd staan"]
[null,"Fout vracht = vrachtwagens die fout geparkeerd staan"]
[null,"E-wagen = geparkeerde elektrisch voertuig bij een"]
[null,"          elektrisch oplaadpunt"]
[null,"Invalide = personenwagens en motoren op voor"]
[null,"          invalide personen bestemde parkeerplaats"]
[null,"Gestalde fietsen = alle gestalde fietsen op de"]
[null,"          daarvoor bestemde parkeerplaatsen"]

{"sheet":"86.Jezus-Eik","index":79,"n_rows":57,"n_cols":26,"rows_kept":57,"cut":false,"hidden":false,"merged":[[4,3,5,12],[4,16,5,16],[15,3,16,12]]}
[]
[null,"PARKEERONDERZOEK",null,"CARPOOLPARKINGS EN P+R PARKINGS"]
[null,86,null,{"$f":"B8 & \" - \"& TEXT(VLOOKUP(B3,Coordinaten!$A$2:$G$95,7,0),\"dddd dd mmmm jjjj\")","v":"Carpool parking Jezus-Eik, Overijse - donderdag 18 november 2021"}]
[null,{"$f":"VLOOKUP(B3,Coordinaten!$A$2:$G$95,6,0)","v":"50.791286, 4.486517"}]
[null,null,null,"BEZETTING  ",null,null,null,null,null,null,null,null,null,null,null,null,"OPMERKINGEN"]
[]
[null,"Onderzoeksgebied",null,"Datum","Geregistreerd tussen","Pers","Vracht","Motor","Obstakel / overig","Fout   pers","Fout Vracht","Totaal","E-wagen\nplaats","Invalidenplaats","Gestalde fietsen",null,null,null,null,null,{"$f":"F7","v":"Pers"},"Vracht","Motor","Obstakel / overig","Fout   pers","Fout Vracht"]
[null,{"$f":"VLOOKUP(B3,Coordinaten!$A$2:$G$95,3,0)&\", \"&VLOOKUP(B3,Coordinaten!$A$2:$G$95,5,0)","v":"Carpool parking Jezus-Eik, Overijse"},null,"2021-11-18","09:00 - 16:00u",57,0,0,0,0,1,58,0,0,0,null,0,null,{"$f":"D8","v":"2021-11-18"},{"$f":"E8","v":"09:00 - 16:00u"},{"$f":"IF(F8=0,NA(),F8/$L8)","v":0.98275862068965514},{"$f":"IF(G8=0,NA(),G8/$L8)","v":{"$error":"#N/A"}},{"$f":"IF(H8=0,NA(),H8/$L8)","v":{"$error":"#N/A"}},{"$error":"#N/A"},{"$error":"#N/A"},1.7241379310344827E-2]
[null,{"$f":"\"Nabij kruispunt: \"&VLOOKUP(B3,Coordinaten!$A$2:$L$95,4,0)","v":"Nabij kruispunt: A4 / Kersenbomenlaan"},null,null,null,0.98275862068965514,"-","-","-","-",1.7241379310344827E-2,1,null,null,null,null,0,null,{"$f":"D10","v":"2021-11-18"},{"$f":"E10","v":"19:00 - 02:00u"},{"$f":"IF(F10=0,NA(),F10/$L10)","v":1},{"$f":"IF(G10=0,NA(),G10/$L10)","v":{"$error":"#N/A"}},{"$error":"#N/A"},{"$error":"#N/A"},{"$error":"#N/A"},{"$error":"#N/A"}]
[null,null,null,"2021-11-18","19:00 - 02:00u",48,0,0,0,0,0,48,0,0,0,null,0]
[null,"Meting",null,null,null,1,"-","-","-","-","-",1,null,null,null,null,0]
[null,{"$f":"\"Meetperiode: \"&TEXT(VLOOKUP(B3,Coordinaten!$A$2:$G$95,7,0),\"dddd dd mmmm jjjj\")","v":"Meetperiode: donderdag 18 november 2021"}]
[null,"Methodiek: Parkeerdrukmeting met waarnemers"]
[null,"In opdracht van: Vlaamse overheid"]
[null,"Uitgevoerd door: Dufec"]
[null,null,null,"VERDELING NAAR CATEGORIE"]
[null,"Locatie"]
[null,{"$f":"IF(B4=\"\",\"\",HYPERLINK(\"http://www.googlemaps.com/?q=\"&B4,\"Lat/Long: \"&B4))","v":"Lat/Long: 50.791286, 4.486517"}]
[]
[null,null,null,null,null,null,null,null,null,null,null,null,null,null,null,"Legenda"]
[null,null,null,null,null,null,null,null,null,null,null,null,null,null,null,null,"Personenwagen"]
[null,null,null,null,null,null,null,null,null,null,null,null,null,null,null,null,"Vracht"]
[null,null,null,null,null,null,null,null,null,null,null,null,null,null,null,null,"Motor"]
[null,null,null,null,null,null,null,null,null,null,null,null,null,null,null,null,"Obstakel / overig"]
[null,null,null,null,null,null,null,null,null,null,null,null,null,null,null,null,"Fout personenwagen"]
[null,null,null,null,null,null,null,null,null,null,null,null,null,null,null,null,"Fout Vracht"]
[]
[]
[]
[]
[]
[]
[]
[]
[]
[]
[]
[null,"Opmerking"]
[null,"Het onderzoek vindt plaats gedurende coronamaatregelen."]
[null,"Dit heeft mogelijk een effect op de resultaten."]
[]
[null,"Toelichting"]
[null,"Pers = personenwagens op daarvoor bestemde"]
[null,"          openbare plaatsen"]
[null,"Vracht = vrachtwagens op daarvoor bestemde"]
[null,"          parkeerplaatsen (middel- en zwaar vrachtverkeer)"]
[null,"Motor = geparkeerde motoren op openbare plaatsen"]
[null,"Obstakel / overig = obstakels of overige voertuigen"]
[null,"          geparkeerd op openbare plaatsen"]
[null,"Fout pers = personenwagens die fout geparkeerd staan"]
[null,"Fout vracht = vrachtwagens die fout geparkeerd staan"]
[null,"E-wagen = geparkeerde elektrisch voertuig bij een"]
[null,"          elektrisch oplaadpunt"]
[null,"Invalide = personenwagens en motoren op voor"]
[null,"          invalide personen bestemde parkeerplaats"]
[null,"Gestalde fietsen = alle gestalde fietsen op de"]
[null,"          daarvoor bestemde parkeerplaatsen"]

{"sheet":"87.Affligem","index":80,"n_rows":57,"n_cols":26,"rows_kept":57,"cut":false,"hidden":false,"merged":[[4,3,5,12],[4,16,5,16],[15,3,16,12]]}
[]
[null,"PARKEERONDERZOEK",null,"CARPOOLPARKINGS EN P+R PARKINGS"]
[null,87,null,{"$f":"B8 & \" - \"& TEXT(VLOOKUP(B3,Coordinaten!$A$2:$G$95,7,0),\"dddd dd mmmm jjjj\")","v":"Carpool parking Affligem, Affligem - dinsdag 23 november 2021"}]
[null,{"$f":"VLOOKUP(B3,Coordinaten!$A$2:$G$95,6,0)","v":"50.893622, 4.119238"}]
[null,null,null,"BEZETTING  ",null,null,null,null,null,null,null,null,null,null,null,null,"OPMERKINGEN"]
[]
[null,"Onderzoeksgebied",null,"Datum","Geregistreerd tussen","Pers","Vracht","Motor","Obstakel / overig","Fout   pers","Fout Vracht","Totaal","E-wagen\nplaats","Invalidenplaats","Gestalde fietsen",null,null,null,null,null,{"$f":"F7","v":"Pers"},"Vracht","Motor","Obstakel / overig","Fout   pers","Fout Vracht"]
[null,{"$f":"VLOOKUP(B3,Coordinaten!$A$2:$G$95,3,0)&\", \"&VLOOKUP(B3,Coordinaten!$A$2:$G$95,5,0)","v":"Carpool parking Affligem, Affligem"},null,"2021-11-23","09:00 - 16:00u",68,0,0,0,0,0,68,0,0,0,null,"Vanaf 20 november nieuwe coronamaatregelen, waaronder verplicht telewerk",null,{"$f":"D8","v":"2021-11-23"},{"$f":"E8","v":"09:00 - 16:00u"},{"$f":"IF(F8=0,NA(),F8/$L8)","v":1},{"$f":"IF(G8=0,NA(),G8/$L8)","v":{"$error":"#N/A"}},{"$f":"IF(H8=0,NA(),H8/$L8)","v":{"$error":"#N/A"}},{"$error":"#N/A"},{"$error":"#N/A"},{"$error":"#N/A"}]
[null,{"$f":"\"Nabij kruispunt: \"&VLOOKUP(B3,Coordinaten!$A$2:$L$95,4,0)","v":"Nabij kruispunt: N208 / A10"},null,null,null,1,"-","-","-","-","-",1,null,null,null,null,0,null,{"$f":"D10","v":"2021-11-23"},{"$f":"E10","v":"19:00 - 02:00u"},{"$f":"IF(F10=0,NA(),F10/$L10)","v":1},{"$f":"IF(G10=0,NA(),G10/$L10)","v":{"$error":"#N/A"}},{"$error":"#N/A"},{"$error":"#N/A"},{"$error":"#N/A"},{"$error":"#N/A"}]
[null,null,null,"2021-11-23","19:00 - 02:00u",13,0,0,0,0,0,13,0,0,0,null,"Vanaf 20 november nieuwe coronamaatregelen, waaronder verplicht telewerk"]
[null,"Meting",null,null,null,1,"-","-","-","-","-",1,null,null,null,null,0]
[null,{"$f":"\"Meetperiode: \"&TEXT(VLOOKUP(B3,Coordinaten!$A$2:$G$95,7,0),\"dddd dd mmmm jjjj\")","v":"Meetperiode: dinsdag 23 november 2021"}]
[null,"Methodiek: Parkeerdrukmeting met waarnemers"]
[null,"In opdracht van: Vlaamse overheid"]
[null,"Uitgevoerd door: Dufec"]
[null,null,null,"VERDELING NAAR CATEGORIE"]
[null,"Locatie"]
[null,{"$f":"IF(B4=\"\",\"\",HYPERLINK(\"http://www.googlemaps.com/?q=\"&B4,\"Lat/Long: \"&B4))","v":"Lat/Long: 50.893622, 4.119238"}]
[]
[null,null,null,null,null,null,null,null,null,null,null,null,null,null,null,"Legenda"]
[null,null,null,null,null,null,null,null,null,null,null,null,null,null,null,null,"Personenwagen"]
[null,null,null,null,null,null,null,null,null,null,null,null,null,null,null,null,"Vracht"]
[null,null,null,null,null,null,null,null,null,null,null,null,null,null,null,null,"Motor"]
[null,null,null,null,null,null,null,null,null,null,null,null,null,null,null,null,"Obstakel / overig"]
[null,null,null,null,null,null,null,null,null,null,null,null,null,null,null,null,"Fout personenwagen"]
[null,null,null,null,null,null,null,null,null,null,null,null,null,null,null,null,"Fout Vracht"]
[]
[]
[]
[]
[]
[]
[]
[]
[]
[]
[]
[null,"Opmerking"]
[null,"Het onderzoek vindt plaats gedurende coronamaatregelen."]
[null,"Dit heeft mogelijk een effect op de resultaten."]
[]
[null,"Toelichting"]
[null,"Pers = personenwagens op daarvoor bestemde"]
[null,"          openbare plaatsen"]
[null,"Vracht = vrachtwagens op daarvoor bestemde"]
[null,"          parkeerplaatsen (middel- en zwaar vrachtverkeer)"]
[null,"Motor = geparkeerde motoren op openbare plaatsen"]
[null,"Obstakel / overig = obstakels of overige voertuigen"]
[null,"          geparkeerd op openbare plaatsen"]
[null,"Fout pers = personenwagens die fout geparkeerd staan"]
[null,"Fout vracht = vrachtwagens die fout geparkeerd staan"]
[null,"E-wagen = geparkeerde elektrisch voertuig bij een"]
[null,"          elektrisch oplaadpunt"]
[null,"Invalide = personenwagens en motoren op voor"]
[null,"          invalide personen bestemde parkeerplaats"]
[null,"Gestalde fietsen = alle gestalde fietsen op de"]
[null,"          daarvoor bestemde parkeerplaatsen"]

{"sheet":"88.Bertem","index":81,"n_rows":57,"n_cols":26,"rows_kept":57,"cut":false,"hidden":false,"merged":[[4,3,5,12],[4,16,5,16],[15,3,16,12]]}
[]
[null,"PARKEERONDERZOEK",null,"CARPOOLPARKINGS EN P+R PARKINGS"]
[null,88,null,{"$f":"B8 & \" - \"& TEXT(VLOOKUP(B3,Coordinaten!$A$2:$G$95,7,0),\"dddd dd mmmm jjjj\")","v":"Carpool parking Bertem, Bertem - dinsdag 16 november 2021"}]
[null,{"$f":"VLOOKUP(B3,Coordinaten!$A$2:$G$95,6,0)","v":"50.861791, 4.613666"}]
[null,null,null,"BEZETTING  ",null,null,null,null,null,null,null,null,null,null,null,null,"OPMERKINGEN"]
[]
[null,"Onderzoeksgebied",null,"Datum","Geregistreerd tussen","Pers","Vracht","Motor","Obstakel / overig","Fout   pers","Fout Vracht","Totaal","E-wagen\nplaats","Invalidenplaats","Gestalde fietsen",null,null,null,null,null,{"$f":"F7","v":"Pers"},"Vracht","Motor","Obstakel / overig","Fout   pers","Fout Vracht"]
[null,{"$f":"VLOOKUP(B3,Coordinaten!$A$2:$G$95,3,0)&\", \"&VLOOKUP(B3,Coordinaten!$A$2:$G$95,5,0)","v":"Carpool parking Bertem, Bertem"},null,"2021-11-16","09:00 - 16:00u",59,0,0,0,1,0,60,0,0,1,null,0,null,{"$f":"D8","v":"2021-11-16"},{"$f":"E8","v":"09:00 - 16:00u"},{"$f":"IF(F8=0,NA(),F8/$L8)","v":0.98333333333333328},{"$f":"IF(G8=0,NA(),G8/$L8)","v":{"$error":"#N/A"}},{"$f":"IF(H8=0,NA(),H8/$L8)","v":{"$error":"#N/A"}},{"$error":"#N/A"},1.6666666666666666E-2,{"$error":"#N/A"}]
[null,{"$f":"\"Nabij kruispunt: \"&VLOOKUP(B3,Coordinaten!$A$2:$L$95,4,0)","v":"Nabij kruispunt: N3 / A3"},null,null,null,0.98333333333333328,"-","-","-",1.6666666666666666E-2,"-",1,null,null,null,null,0,null,{"$f":"D10","v":"2021-11-16"},{"$f":"E10","v":"19:00 - 02:00u"},{"$f":"IF(F10=0,NA(),F10/$L10)","v":0.98461538461538467},{"$f":"IF(G10=0,NA(),G10/$L10)","v":{"$error":"#N/A"}},{"$error":"#N/A"},{"$error":"#N/A"},{"$error":"#N/A"},1.5384615384615385E-2]
[null,null,null,"2021-11-16","19:00 - 02:00u",64,0,0,0,0,1,65,0,0,1,null,"Fout vracht: Bus op parkeerplaats"]
[null,"Meting",null,null,null,0.98461538461538467,"-","-","-","-",1.5384615384615385E-2,1,null,null,null,null,0]
[null,{"$f":"\"Meetperiode: \"&TEXT(VLOOKUP(B3,Coordinaten!$A$2:$G$95,7,0),\"dddd dd mmmm jjjj\")","v":"Meetperiode: dinsdag 16 november 2021"}]
[null,"Methodiek: Parkeerdrukmeting met waarnemers"]
[null,"In opdracht van: Vlaamse overheid"]
[null,"Uitgevoerd door: Dufec"]
[null,null,null,"VERDELING NAAR CATEGORIE"]
[null,"Locatie"]
[null,{"$f":"IF(B4=\"\",\"\",HYPERLINK(\"http://www.googlemaps.com/?q=\"&B4,\"Lat/Long: \"&B4))","v":"Lat/Long: 50.861791, 4.613666"}]
[]
[null,null,null,null,null,null,null,null,null,null,null,null,null,null,null,"Legenda"]
[null,null,null,null,null,null,null,null,null,null,null,null,null,null,null,null,"Personenwagen"]
[null,null,null,null,null,null,null,null,null,null,null,null,null,null,null,null,"Vracht"]
[null,null,null,null,null,null,null,null,null,null,null,null,null,null,null,null,"Motor"]
[null,null,null,null,null,null,null,null,null,null,null,null,null,null,null,null,"Obstakel / overig"]
[null,null,null,null,null,null,null,null,null,null,null,null,null,null,null,null,"Fout personenwagen"]
[null,null,null,null,null,null,null,null,null,null,null,null,null,null,null,null,"Fout Vracht"]
[]
[]
[]
[]
[]
[]
[]
[]
[]
[]
[]
[null,"Opmerking"]
[null,"Het onderzoek vindt plaats gedurende coronamaatregelen."]
[null,"Dit heeft mogelijk een effect op de resultaten."]
[]
[null,"Toelichting"]
[null,"Pers = personenwagens op daarvoor bestemde"]
[null,"          openbare plaatsen"]
[null,"Vracht = vrachtwagens op daarvoor bestemde"]
[null,"          parkeerplaatsen (middel- en zwaar vrachtverkeer)"]
[null,"Motor = geparkeerde motoren op openbare plaatsen"]
[null,"Obstakel / overig = obstakels of overige voertuigen"]
[null,"          geparkeerd op openbare plaatsen"]
[null,"Fout pers = personenwagens die fout geparkeerd staan"]
[null,"Fout vracht = vrachtwagens die fout geparkeerd staan"]
[null,"E-wagen = geparkeerde elektrisch voertuig bij een"]
[null,"          elektrisch oplaadpunt"]
[null,"Invalide = personenwagens en motoren op voor"]
[null,"          invalide personen bestemde parkeerplaats"]
[null,"Gestalde fietsen = alle gestalde fietsen op de"]
[null,"          daarvoor bestemde parkeerplaatsen"]

{"sheet":"89.Hoegaarden","index":82,"n_rows":57,"n_cols":26,"rows_kept":57,"cut":false,"hidden":false,"merged":[[4,3,5,12],[4,16,5,16],[15,3,16,12]]}
[]
[null,"PARKEERONDERZOEK",null,"CARPOOLPARKINGS EN P+R PARKINGS"]
[null,89,null,{"$f":"B8 & \" - \"& TEXT(VLOOKUP(B3,Coordinaten!$A$2:$G$95,7,0),\"dddd dd mmmm jjjj\")","v":"Carpool parking Hoegaarden, Hoegaarden - dinsdag 16 november 2021"}]
[null,{"$f":"VLOOKUP(B3,Coordinaten!$A$2:$G$95,6,0)","v":"50.780420, 4.919336"}]
[null,null,null,"BEZETTING  ",null,null,null,null,null,null,null,null,null,null,null,null,"OPMERKINGEN"]
[]
[null,"Onderzoeksgebied",null,"Datum","Geregistreerd tussen","Pers","Vracht","Motor","Obstakel / overig","Fout   pers","Fout Vracht","Totaal","E-wagen\nplaats","Invalidenplaats","Gestalde fietsen",null,null,null,null,null,{"$f":"F7","v":"Pers"},"Vracht","Motor","Obstakel / overig","Fout   pers","Fout Vracht"]
[null,{"$f":"VLOOKUP(B3,Coordinaten!$A$2:$G$95,3,0)&\", \"&VLOOKUP(B3,Coordinaten!$A$2:$G$95,5,0)","v":"Carpool parking Hoegaarden, Hoegaarden"},null,"2021-11-16","09:00 - 16:00u",44,2,0,5,1,1,53,0,0,0,null,"Obstakel: 5 opleggers",null,{"$f":"D8","v":"2021-11-16"},{"$f":"E8","v":"09:00 - 16:00u"},{"$f":"IF(F8=0,NA(),F8/$L8)","v":0.83018867924528306},{"$f":"IF(G8=0,NA(),G8/$L8)","v":3.7735849056603772E-2},{"$f":"IF(H8=0,NA(),H8/$L8)","v":{"$error":"#N/A"}},9.4339622641509441E-2,1.8867924528301886E-2,1.8867924528301886E-2]
[null,{"$f":"\"Nabij kruispunt: \"&VLOOKUP(B3,Coordinaten!$A$2:$L$95,4,0)","v":"Nabij kruispunt: N29 / A3"},null,null,null,0.83018867924528306,3.7735849056603772E-2,"-",9.4339622641509441E-2,1.8867924528301886E-2,1.8867924528301886E-2,1,null,null,null,null,0,null,{"$f":"D10","v":"2021-11-16"},{"$f":"E10","v":"19:00 - 02:00u"},{"$f":"IF(F10=0,NA(),F10/$L10)","v":0.66666666666666663},{"$f":"IF(G10=0,NA(),G10/$L10)","v":{"$error":"#N/A"}},{"$error":"#N/A"},{"$error":"#N/A"},{"$error":"#N/A"},0.33333333333333331]
[null,null,null,"2021-11-16","19:00 - 02:00u",16,0,0,0,0,8,24,0,0,0,null,0]
[null,"Meting",null,null,null,0.66666666666666663,"-","-","-","-",0.33333333333333331,1,null,null,null,null,0]
[null,{"$f":"\"Meetperiode: \"&TEXT(VLOOKUP(B3,Coordinaten!$A$2:$G$95,7,0),\"dddd dd mmmm jjjj\")","v":"Meetperiode: dinsdag 16 november 2021"}]
[null,"Methodiek: Parkeerdrukmeting met waarnemers"]
[null,"In opdracht van: Vlaamse overheid"]
[null,"Uitgevoerd door: Dufec"]
[null,null,null,"VERDELING NAAR CATEGORIE"]
[null,"Locatie"]
[null,{"$f":"IF(B4=\"\",\"\",HYPERLINK(\"http://www.googlemaps.com/?q=\"&B4,\"Lat/Long: \"&B4))","v":"Lat/Long: 50.780420, 4.919336"}]
[]
[null,null,null,null,null,null,null,null,null,null,null,null,null,null,null,"Legenda"]
[null,null,null,null,null,null,null,null,null,null,null,null,null,null,null,null,"Personenwagen"]
[null,null,null,null,null,null,null,null,null,null,null,null,null,null,null,null,"Vracht"]
[null,null,null,null,null,null,null,null,null,null,null,null,null,null,null,null,"Motor"]
[null,null,null,null,null,null,null,null,null,null,null,null,null,null,null,null,"Obstakel / overig"]
[null,null,null,null,null,null,null,null,null,null,null,null,null,null,null,null,"Fout personenwagen"]
[null,null,null,null,null,null,null,null,null,null,null,null,null,null,null,null,"Fout Vracht"]
[]
[]
[]
[]
[]
[]
[]
[]
[]
[]
[]
[null,"Opmerking"]
[null,"Het onderzoek vindt plaats gedurende coronamaatregelen."]
[null,"Dit heeft mogelijk een effect op de resultaten."]
[]
[null,"Toelichting"]
[null,"Pers = personenwagens op daarvoor bestemde"]
[null,"          openbare plaatsen"]
[null,"Vracht = vrachtwagens op daarvoor bestemde"]
[null,"          parkeerplaatsen (middel- en zwaar vrachtverkeer)"]
[null,"Motor = geparkeerde motoren op openbare plaatsen"]
[null,"Obstakel / overig = obstakels of overige voertuigen"]
[null,"          geparkeerd op openbare plaatsen"]
[null,"Fout pers = personenwagens die fout geparkeerd staan"]
[null,"Fout vracht = vrachtwagens die fout geparkeerd staan"]
[null,"E-wagen = geparkeerde elektrisch voertuig bij een"]
[null,"          elektrisch oplaadpunt"]
[null,"Invalide = personenwagens en motoren op voor"]
[null,"          invalide personen bestemde parkeerplaats"]
[null,"Gestalde fietsen = alle gestalde fietsen op de"]
[null,"          daarvoor bestemde parkeerplaatsen"]

{"sheet":"90.Kampenhout","index":83,"n_rows":57,"n_cols":26,"rows_kept":57,"cut":false,"hidden":false,"merged":[[4,3,5,12],[4,16,5,16],[15,3,16,12]]}
[]
[null,"PARKEERONDERZOEK",null,"CARPOOLPARKINGS EN P+R PARKINGS"]
[null,90,null,{"$f":"B8 & \" - \"& TEXT(VLOOKUP(B3,Coordinaten!$A$2:$G$95,7,0),\"dddd dd mmmm jjjj\")","v":"Carpool parking Kampenhout, Kampenhout - dinsdag 16 november 2021"}]
[null,{"$f":"VLOOKUP(B3,Coordinaten!$A$2:$G$95,6,0)","v":"50.955475, 4.594162"}]
[null,null,null,"BEZETTING  ",null,null,null,null,null,null,null,null,null,null,null,null,"OPMERKINGEN"]
[]
[null,"Onderzoeksgebied",null,"Datum","Geregistreerd tussen","Pers","Vracht","Motor","Obstakel / overig","Fout   pers","Fout Vracht","Totaal","E-wagen\nplaats","Invalidenplaats","Gestalde fietsen",null,null,null,null,null,{"$f":"F7","v":"Pers"},"Vracht","Motor","Obstakel / overig","Fout   pers","Fout Vracht"]
[null,{"$f":"VLOOKUP(B3,Coordinaten!$A$2:$G$95,3,0)&\", \"&VLOOKUP(B3,Coordinaten!$A$2:$G$95,5,0)","v":"Carpool parking Kampenhout, Kampenhout"},null,"2021-11-16","09:00 - 16:00u",6,0,0,0,0,0,6,0,0,4,null,0,null,{"$f":"D8","v":"2021-11-16"},{"$f":"E8","v":"09:00 - 16:00u"},{"$f":"IF(F8=0,NA(),F8/$L8)","v":1},{"$f":"IF(G8=0,NA(),G8/$L8)","v":{"$error":"#N/A"}},{"$f":"IF(H8=0,NA(),H8/$L8)","v":{"$error":"#N/A"}},{"$error":"#N/A"},{"$error":"#N/A"},{"$error":"#N/A"}]
[null,{"$f":"\"Nabij kruispunt: \"&VLOOKUP(B3,Coordinaten!$A$2:$L$95,4,0)","v":"Nabij kruispunt: N21 / N26"},null,null,null,1,"-","-","-","-","-",1,null,null,null,null,0,null,{"$f":"D10","v":"2021-11-16"},{"$f":"E10","v":"19:00 - 02:00u"},{"$f":"IF(F10=0,NA(),F10/$L10)","v":1},{"$f":"IF(G10=0,NA(),G10/$L10)","v":{"$error":"#N/A"}},{"$error":"#N/A"},{"$error":"#N/A"},{"$error":"#N/A"},{"$error":"#N/A"}]
[null,null,null,"2021-11-16","19:00 - 02:00u",6,0,0,0,0,0,6,0,0,0,null,0]
[null,"Meting",null,null,null,1,"-","-","-","-","-",1,null,null,null,null,0]
[null,{"$f":"\"Meetperiode: \"&TEXT(VLOOKUP(B3,Coordinaten!$A$2:$G$95,7,0),\"dddd dd mmmm jjjj\")","v":"Meetperiode: dinsdag 16 november 2021"}]
[null,"Methodiek: Parkeerdrukmeting met waarnemers"]
[null,"In opdracht van: Vlaamse overheid"]
[null,"Uitgevoerd door: Dufec"]
[null,null,null,"VERDELING NAAR CATEGORIE"]
[null,"Locatie"]
[null,{"$f":"IF(B4=\"\",\"\",HYPERLINK(\"http://www.googlemaps.com/?q=\"&B4,\"Lat/Long: \"&B4))","v":"Lat/Long: 50.955475, 4.594162"}]
[]
[null,null,null,null,null,null,null,null,null,null,null,null,null,null,null,"Legenda"]
[null,null,null,null,null,null,null,null,null,null,null,null,null,null,null,null,"Personenwagen"]
[null,null,null,null,null,null,null,null,null,null,null,null,null,null,null,null,"Vracht"]
[null,null,null,null,null,null,null,null,null,null,null,null,null,null,null,null,"Motor"]
[null,null,null,null,null,null,null,null,null,null,null,null,null,null,null,null,"Obstakel / overig"]
[null,null,null,null,null,null,null,null,null,null,null,null,null,null,null,null,"Fout personenwagen"]
[null,null,null,null,null,null,null,null,null,null,null,null,null,null,null,null,"Fout Vracht"]
[]
[]
[]
[]
[]
[]
[]
[]
[]
[]
[]
[null,"Opmerking"]
[null,"Het onderzoek vindt plaats gedurende coronamaatregelen."]
[null,"Dit heeft mogelijk een effect op de resultaten."]
[]
[null,"Toelichting"]
[null,"Pers = personenwagens op daarvoor bestemde"]
[null,"          openbare plaatsen"]
[null,"Vracht = vrachtwagens op daarvoor bestemde"]
[null,"          parkeerplaatsen (middel- en zwaar vrachtverkeer)"]
[null,"Motor = geparkeerde motoren op openbare plaatsen"]
[null,"Obstakel / overig = obstakels of overige voertuigen"]
[null,"          geparkeerd op openbare plaatsen"]
[null,"Fout pers = personenwagens die fout geparkeerd staan"]
[null,"Fout vracht = vrachtwagens die fout geparkeerd staan"]
[null,"E-wagen = geparkeerde elektrisch voertuig bij een"]
[null,"          elektrisch oplaadpunt"]
[null,"Invalide = personenwagens en motoren op voor"]
[null,"          invalide personen bestemde parkeerplaats"]
[null,"Gestalde fietsen = alle gestalde fietsen op de"]
[null,"          daarvoor bestemde parkeerplaatsen"]

{"sheet":"91.Nevele","index":84,"n_rows":57,"n_cols":26,"rows_kept":57,"cut":false,"hidden":false,"merged":[[4,3,5,12],[4,16,5,16],[15,3,16,12]]}
[]
[null,"PARKEERONDERZOEK",null,"CARPOOLPARKINGS EN P+R PARKINGS"]
[null,91,null,{"$f":"B8 & \" - \"& TEXT(VLOOKUP(B3,Coordinaten!$A$2:$G$95,7,0),\"dddd dd mmmm jjjj\")","v":"Carpool parking Nevele, Nevele - dinsdag 09 november 2021"}]
[null,{"$f":"VLOOKUP(B3,Coordinaten!$A$2:$G$95,6,0)","v":"51.056514, 3.527934"}]
[null,null,null,"BEZETTING  ",null,null,null,null,null,null,null,null,null,null,null,null,"OPMERKINGEN"]
[]
[null,"Onderzoeksgebied",null,"Datum","Geregistreerd tussen","Pers","Vracht","Motor","Obstakel / overig","Fout   pers","Fout Vracht","Totaal","E-wagen\nplaats","Invalidenplaats","Gestalde fietsen",null,null,null,null,null,{"$f":"F7","v":"Pers"},"Vracht","Motor","Obstakel / overig","Fout   pers","Fout Vracht"]
[null,{"$f":"VLOOKUP(B3,Coordinaten!$A$2:$G$95,3,0)&\", \"&VLOOKUP(B3,Coordinaten!$A$2:$G$95,5,0)","v":"Carpool parking Nevele, Nevele"},null,"2021-11-09","09:00 - 16:00u",31,0,0,0,0,0,31,0,0,0,null,0,null,{"$f":"D8","v":"2021-11-09"},{"$f":"E8","v":"09:00 - 16:00u"},{"$f":"IF(F8=0,NA(),F8/$L8)","v":1},{"$f":"IF(G8=0,NA(),G8/$L8)","v":{"$error":"#N/A"}},{"$f":"IF(H8=0,NA(),H8/$L8)","v":{"$error":"#N/A"}},{"$error":"#N/A"},{"$error":"#N/A"},{"$error":"#N/A"}]
[null,{"$f":"\"Nabij kruispunt: \"&VLOOKUP(B3,Coordinaten!$A$2:$L$95,4,0)","v":"Nabij kruispunt: N437 / A10"},null,null,null,1,"-","-","-","-","-",1,null,null,null,null,0,null,{"$f":"D10","v":"2021-11-09"},{"$f":"E10","v":"19:00 - 02:00u"},{"$f":"IF(F10=0,NA(),F10/$L10)","v":1},{"$f":"IF(G10=0,NA(),G10/$L10)","v":{"$error":"#N/A"}},{"$error":"#N/A"},{"$error":"#N/A"},{"$error":"#N/A"},{"$error":"#N/A"}]
[null,null,null,"2021-11-09","19:00 - 02:00u",5,0,0,0,0,0,5,0,1,0,null,0]
[null,"Meting",null,null,null,1,"-","-","-","-","-",1,null,null,null,null,0]
[null,{"$f":"\"Meetperiode: \"&TEXT(VLOOKUP(B3,Coordinaten!$A$2:$G$95,7,0),\"dddd dd mmmm jjjj\")","v":"Meetperiode: dinsdag 09 november 2021"}]
[null,"Methodiek: Parkeerdrukmeting met waarnemers"]
[null,"In opdracht van: Vlaamse overheid"]
[null,"Uitgevoerd door: Dufec"]
[null,null,null,"VERDELING NAAR CATEGORIE"]
[null,"Locatie"]
[null,{"$f":"IF(B4=\"\",\"\",HYPERLINK(\"http://www.googlemaps.com/?q=\"&B4,\"Lat/Long: \"&B4))","v":"Lat/Long: 51.056514, 3.527934"}]
[]
[null,null,null,null,null,null,null,null,null,null,null,null,null,null,null,"Legenda"]
[null,null,null,null,null,null,null,null,null,null,null,null,null,null,null,null,"Personenwagen"]
[null,null,null,null,null,null,null,null,null,null,null,null,null,null,null,null,"Vracht"]
[null,null,null,null,null,null,null,null,null,null,null,null,null,null,null,null,"Motor"]
[null,null,null,null,null,null,null,null,null,null,null,null,null,null,null,null,"Obstakel / overig"]
[null,null,null,null,null,null,null,null,null,null,null,null,null,null,null,null,"Fout personenwagen"]
[null,null,null,null,null,null,null,null,null,null,null,null,null,null,null,null,"Fout Vracht"]
[]
[]
[]
[]
[]
[]
[]
[]
[]
[]
[]
[null,"Opmerking"]
[null,"Het onderzoek vindt plaats gedurende coronamaatregelen."]
[null,"Dit heeft mogelijk een effect op de resultaten."]
[]
[null,"Toelichting"]
[null,"Pers = personenwagens op daarvoor bestemde"]
[null,"          openbare plaatsen"]
[null,"Vracht = vrachtwagens op daarvoor bestemde"]
[null,"          parkeerplaatsen (middel- en zwaar vrachtverkeer)"]
[null,"Motor = geparkeerde motoren op openbare plaatsen"]
[null,"Obstakel / overig = obstakels of overige voertuigen"]
[null,"          geparkeerd op openbare plaatsen"]
[null,"Fout pers = personenwagens die fout geparkeerd staan"]
[null,"Fout vracht = vrachtwagens die fout geparkeerd staan"]
[null,"E-wagen = geparkeerde elektrisch voertuig bij een"]
[null,"          elektrisch oplaadpunt"]
[null,"Invalide = personenwagens en motoren op voor"]
[null,"          invalide personen bestemde parkeerplaats"]
[null,"Gestalde fietsen = alle gestalde fietsen op de"]
[null,"          daarvoor bestemde parkeerplaatsen"]

{"sheet":"92.Beerse-Vosselaar","index":85,"n_rows":57,"n_cols":26,"rows_kept":57,"cut":false,"hidden":false,"merged":[[4,3,5,12],[4,16,5,16],[15,3,16,12]]}
[]
[null,"PARKEERONDERZOEK",null,"CARPOOLPARKINGS EN P+R PARKINGS"]
[null,92,null,{"$f":"B8 & \" - \"& TEXT(VLOOKUP(B3,Coordinaten!$A$2:$G$95,7,0),\"dddd dd mmmm jjjj\")","v":"P+R parking Beerse-Vosselaar, Lille - donderdag 18 november 2021"}]
[null,{"$f":"VLOOKUP(B3,Coordinaten!$A$2:$G$95,6,0)","v":"51.289402, 4.856541"}]
[null,null,null,"BEZETTING  ",null,null,null,null,null,null,null,null,null,null,null,null,"OPMERKINGEN"]
[]
[null,"Onderzoeksgebied",null,"Datum","Geregistreerd tussen","Pers","Vracht","Motor","Obstakel / overig","Fout   pers","Fout Vracht","Totaal","E-wagen\nplaats","Invalidenplaats","Gestalde fietsen",null,null,null,null,null,{"$f":"F7","v":"Pers"},"Vracht","Motor","Obstakel / overig","Fout   pers","Fout Vracht"]
[null,{"$f":"VLOOKUP(B3,Coordinaten!$A$2:$G$95,3,0)&\", \"&VLOOKUP(B3,Coordinaten!$A$2:$G$95,5,0)","v":"P+R parking Beerse-Vosselaar, Lille"},null,"2021-11-18","09:00 - 16:00u",29,0,0,0,0,0,29,0,0,0,null,0,null,{"$f":"D8","v":"2021-11-18"},{"$f":"E8","v":"09:00 - 16:00u"},{"$f":"IF(F8=0,NA(),F8/$L8)","v":1},{"$f":"IF(G8=0,NA(),G8/$L8)","v":{"$error":"#N/A"}},{"$f":"IF(H8=0,NA(),H8/$L8)","v":{"$error":"#N/A"}},{"$error":"#N/A"},{"$error":"#N/A"},{"$error":"#N/A"}]
[null,{"$f":"\"Nabij kruispunt: \"&VLOOKUP(B3,Coordinaten!$A$2:$L$95,4,0)","v":"Nabij kruispunt: N132 / A21"},null,null,null,1,"-","-","-","-","-",1,null,null,null,null,0,null,{"$f":"D10","v":"2021-11-18"},{"$f":"E10","v":"19:00 - 02:00u"},{"$f":"IF(F10=0,NA(),F10/$L10)","v":1},{"$f":"IF(G10=0,NA(),G10/$L10)","v":{"$error":"#N/A"}},{"$error":"#N/A"},{"$error":"#N/A"},{"$error":"#N/A"},{"$error":"#N/A"}]
[null,null,null,"2021-11-18","19:00 - 02:00u",7,0,0,0,0,0,7,0,0,0,null,0]
[null,"Meting",null,null,null,1,"-","-","-","-","-",1,null,null,null,null,0]
[null,{"$f":"\"Meetperiode: \"&TEXT(VLOOKUP(B3,Coordinaten!$A$2:$G$95,7,0),\"dddd dd mmmm jjjj\")","v":"Meetperiode: donderdag 18 november 2021"}]
[null,"Methodiek: Parkeerdrukmeting met waarnemers"]
[null,"In opdracht van: Vlaamse overheid"]
[null,"Uitgevoerd door: Dufec"]
[null,null,null,"VERDELING NAAR CATEGORIE"]
[null,"Locatie"]
[null,{"$f":"IF(B4=\"\",\"\",HYPERLINK(\"http://www.googlemaps.com/?q=\"&B4,\"Lat/Long: \"&B4))","v":"Lat/Long: 51.289402, 4.856541"}]
[]
[null,null,null,null,null,null,null,null,null,null,null,null,null,null,null,"Legenda"]
[null,null,null,null,null,null,null,null,null,null,null,null,null,null,null,null,"Personenwagen"]
[null,null,null,null,null,null,null,null,null,null,null,null,null,null,null,null,"Vracht"]
[null,null,null,null,null,null,null,null,null,null,null,null,null,null,null,null,"Motor"]
[null,null,null,null,null,null,null,null,null,null,null,null,null,null,null,null,"Obstakel / overig"]
[null,null,null,null,null,null,null,null,null,null,null,null,null,null,null,null,"Fout personenwagen"]
[null,null,null,null,null,null,null,null,null,null,null,null,null,null,null,null,"Fout Vracht"]
[]
[]
[]
[]
[]
[]
[]
[]
[]
[]
[]
[null,"Opmerking"]
[null,"Het onderzoek vindt plaats gedurende coronamaatregelen."]
[null,"Dit heeft mogelijk een effect op de resultaten."]
[]
[null,"Toelichting"]
[null,"Pers = personenwagens op daarvoor bestemde"]
[null,"          openbare plaatsen"]
[null,"Vracht = vrachtwagens op daarvoor bestemde"]
[null,"          parkeerplaatsen (middel- en zwaar vrachtverkeer)"]
[null,"Motor = geparkeerde motoren op openbare plaatsen"]
[null,"Obstakel / overig = obstakels of overige voertuigen"]
[null,"          geparkeerd op openbare plaatsen"]
[null,"Fout pers = personenwagens die fout geparkeerd staan"]
[null,"Fout vracht = vrachtwagens die fout geparkeerd staan"]
[null,"E-wagen = geparkeerde elektrisch voertuig bij een"]
[null,"          elektrisch oplaadpunt"]
[null,"Invalide = personenwagens en motoren op voor"]
[null,"          invalide personen bestemde parkeerplaats"]
[null,"Gestalde fietsen = alle gestalde fietsen op de"]
[null,"          daarvoor bestemde parkeerplaatsen"]

{"sheet":"93.Terlaemen","index":86,"n_rows":57,"n_cols":26,"rows_kept":57,"cut":false,"hidden":false,"merged":[[4,3,5,12],[4,16,5,16],[15,3,16,12]]}
[]
[null,"PARKEERONDERZOEK",null,"CARPOOLPARKINGS EN P+R PARKINGS"]
[null,93,null,{"$f":"B8 & \" - \"& TEXT(VLOOKUP(B3,Coordinaten!$A$2:$G$95,7,0),\"dddd dd mmmm jjjj\")","v":"Carpool parking Terlaemen, Heusden-Zolder - donderdag 18 november 2021"}]
[null,{"$f":"VLOOKUP(B3,Coordinaten!$A$2:$G$95,6,0)","v":"51.006354, 5.271851"}]
[null,null,null,"BEZETTING  ",null,null,null,null,null,null,null,null,null,null,null,null,"OPMERKINGEN"]
[]
[null,"Onderzoeksgebied",null,"Datum","Geregistreerd tussen","Pers","Vracht","Motor","Obstakel / overig","Fout   pers","Fout Vracht","Totaal","E-wagen\nplaats","Invalidenplaats","Gestalde fietsen",null,null,null,null,null,{"$f":"F7","v":"Pers"},"Vracht","Motor","Obstakel / overig","Fout   pers","Fout Vracht"]
[null,{"$f":"VLOOKUP(B3,Coordinaten!$A$2:$G$95,3,0)&\", \"&VLOOKUP(B3,Coordinaten!$A$2:$G$95,5,0)","v":"Carpool parking Terlaemen, Heusden-Zolder"},null,"2021-11-18","09:00 - 16:00u",3,0,0,0,0,0,3,0,0,0,null,"Moeilijk te bereiken wegen wegwerkzaamheden",null,{"$f":"D8","v":"2021-11-18"},{"$f":"E8","v":"09:00 - 16:00u"},{"$f":"IF(F8=0,NA(),F8/$L8)","v":1},{"$f":"IF(G8=0,NA(),G8/$L8)","v":{"$error":"#N/A"}},{"$f":"IF(H8=0,NA(),H8/$L8)","v":{"$error":"#N/A"}},{"$error":"#N/A"},{"$error":"#N/A"},{"$error":"#N/A"}]
[null,{"$f":"\"Nabij kruispunt: \"&VLOOKUP(B3,Coordinaten!$A$2:$L$95,4,0)","v":"Nabij kruispunt: N729 / Snelwegstraat"},null,null,null,1,"-","-","-","-","-",1,null,null,null,null,0,null,{"$f":"D10","v":"2021-11-18"},{"$f":"E10","v":"19:00 - 02:00u"},{"$f":"IF(F10=0,NA(),F10/$L10)","v":{"$error":"#N/A"}},{"$f":"IF(G10=0,NA(),G10/$L10)","v":{"$error":"#N/A"}},{"$error":"#N/A"},{"$error":"#N/A"},{"$error":"#N/A"},{"$error":"#N/A"}]
[null,null,null,"2021-11-18","19:00 - 02:00u",0,0,0,0,0,0,0,0,0,0,null,"De veldwerker heeft deze locatie niet kunnen bereiken, dus niet geteld"]
[null,"Meting",null,null,null,"-","-","-","-","-","-","-",null,null,null,null,0]
[null,{"$f":"\"Meetperiode: \"&TEXT(VLOOKUP(B3,Coordinaten!$A$2:$G$95,7,0),\"dddd dd mmmm jjjj\")","v":"Meetperiode: donderdag 18 november 2021"}]
[null,"Methodiek: Parkeerdrukmeting met waarnemers"]
[null,"In opdracht van: Vlaamse overheid"]
[null,"Uitgevoerd door: Dufec"]
[null,null,null,"VERDELING NAAR CATEGORIE"]
[null,"Locatie"]
[null,{"$f":"IF(B4=\"\",\"\",HYPERLINK(\"http://www.googlemaps.com/?q=\"&B4,\"Lat/Long: \"&B4))","v":"Lat/Long: 51.006354, 5.271851"}]
[]
[null,null,null,null,null,null,null,null,null,null,null,null,null,null,null,"Legenda"]
[null,null,null,null,null,null,null,null,null,null,null,null,null,null,null,null,"Personenwagen"]
[null,null,null,null,null,null,null,null,null,null,null,null,null,null,null,null,"Vracht"]
[null,null,null,null,null,null,null,null,null,null,null,null,null,null,null,null,"Motor"]
[null,null,null,null,null,null,null,null,null,null,null,null,null,null,null,null,"Obstakel / overig"]
[null,null,null,null,null,null,null,null,null,null,null,null,null,null,null,null,"Fout personenwagen"]
[null,null,null,null,null,null,null,null,null,null,null,null,null,null,null,null,"Fout Vracht"]
[]
[]
[]
[]
[]
[]
[]
[]
[]
[]
[]
[null,"Opmerking"]
[null,"Het onderzoek vindt plaats gedurende coronamaatregelen."]
[null,"Dit heeft mogelijk een effect op de resultaten."]
[]
[null,"Toelichting"]
[null,"Pers = personenwagens op daarvoor bestemde"]
[null,"          openbare plaatsen"]
[null,"Vracht = vrachtwagens op daarvoor bestemde"]
[null,"          parkeerplaatsen (middel- en zwaar vrachtverkeer)"]
[null,"Motor = geparkeerde motoren op openbare plaatsen"]
[null,"Obstakel / overig = obstakels of overige voertuigen"]
[null,"          geparkeerd op openbare plaatsen"]
[null,"Fout pers = personenwagens die fout geparkeerd staan"]
[null,"Fout vracht = vrachtwagens die fout geparkeerd staan"]
[null,"E-wagen = geparkeerde elektrisch voertuig bij een"]
[null,"          elektrisch oplaadpunt"]
[null,"Invalide = personenwagens en motoren op voor"]
[null,"          invalide personen bestemde parkeerplaats"]
[null,"Gestalde fietsen = alle gestalde fietsen op de"]
[null,"          daarvoor bestemde parkeerplaatsen"]

{"sheet":"94.Boechout","index":87,"n_rows":57,"n_cols":26,"rows_kept":57,"cut":false,"hidden":false,"merged":[[4,3,5,12],[4,16,5,16],[15,3,16,12]]}
[]
[null,"PARKEERONDERZOEK",null,"CARPOOLPARKINGS EN P+R PARKINGS"]
[null,94,null,{"$f":"B8 & \" - \"& TEXT(VLOOKUP(B3,Coordinaten!$A$2:$G$95,7,0),\"dddd dd mmmm jjjj\")","v":"P+R parking Boechout, Boechout - donderdag 18 november 2021"}]
[null,{"$f":"VLOOKUP(B3,Coordinaten!$A$2:$G$95,6,0)","v":"51.168563, 4.494312"}]
[null,null,null,"BEZETTING  ",null,null,null,null,null,null,null,null,null,null,null,null,"OPMERKINGEN"]
[]
[null,"Onderzoeksgebied",null,"Datum","Geregistreerd tussen","Pers","Vracht","Motor","Obstakel / overig","Fout   pers","Fout Vracht","Totaal","E-wagen\nplaats","Invalidenplaats","Gestalde fietsen",null,null,null,null,null,{"$f":"F7","v":"Pers"},"Vracht","Motor","Obstakel / overig","Fout   pers","Fout Vracht"]
[null,{"$f":"VLOOKUP(B3,Coordinaten!$A$2:$G$95,3,0)&\", \"&VLOOKUP(B3,Coordinaten!$A$2:$G$95,5,0)","v":"P+R parking Boechout, Boechout"},null,"2021-11-18","09:00 - 16:00u",130,0,0,0,0,0,130,0,0,0,null,0,null,{"$f":"D8","v":"2021-11-18"},{"$f":"E8","v":"09:00 - 16:00u"},{"$f":"IF(F8=0,NA(),F8/$L8)","v":1},{"$f":"IF(G8=0,NA(),G8/$L8)","v":{"$error":"#N/A"}},{"$f":"IF(H8=0,NA(),H8/$L8)","v":{"$error":"#N/A"}},{"$error":"#N/A"},{"$error":"#N/A"},{"$error":"#N/A"}]
[null,{"$f":"\"Nabij kruispunt: \"&VLOOKUP(B3,Coordinaten!$A$2:$L$95,4,0)","v":"Nabij kruispunt: N10 / Borsbeeksesteenweg"},null,null,null,1,"-","-","-","-","-",1,null,null,null,null,0,null,{"$f":"D10","v":"2021-11-18"},{"$f":"E10","v":"19:00 - 02:00u"},{"$f":"IF(F10=0,NA(),F10/$L10)","v":1},{"$f":"IF(G10=0,NA(),G10/$L10)","v":{"$error":"#N/A"}},{"$error":"#N/A"},{"$error":"#N/A"},{"$error":"#N/A"},{"$error":"#N/A"}]
[null,null,null,"2021-11-18","19:00 - 02:00u",19,0,0,0,0,0,19,0,0,45,null,0]
[null,"Meting",null,null,null,1,"-","-","-","-","-",1,null,null,null,null,0]
[null,{"$f":"\"Meetperiode: \"&TEXT(VLOOKUP(B3,Coordinaten!$A$2:$G$95,7,0),\"dddd dd mmmm jjjj\")","v":"Meetperiode: donderdag 18 november 2021"}]
[null,"Methodiek: Parkeerdrukmeting met waarnemers"]
[null,"In opdracht van: Vlaamse overheid"]
[null,"Uitgevoerd door: Dufec"]
[null,null,null,"VERDELING NAAR CATEGORIE"]
[null,"Locatie"]
[null,{"$f":"IF(B4=\"\",\"\",HYPERLINK(\"http://www.googlemaps.com/?q=\"&B4,\"Lat/Long: \"&B4))","v":"Lat/Long: 51.168563, 4.494312"}]
[]
[null,null,null,null,null,null,null,null,null,null,null,null,null,null,null,"Legenda"]
[null,null,null,null,null,null,null,null,null,null,null,null,null,null,null,null,"Personenwagen"]
[null,null,null,null,null,null,null,null,null,null,null,null,null,null,null,null,"Vracht"]
[null,null,null,null,null,null,null,null,null,null,null,null,null,null,null,null,"Motor"]
[null,null,null,null,null,null,null,null,null,null,null,null,null,null,null,null,"Obstakel / overig"]
[null,null,null,null,null,null,null,null,null,null,null,null,null,null,null,null,"Fout personenwagen"]
[null,null,null,null,null,null,null,null,null,null,null,null,null,null,null,null,"Fout Vracht"]
[]
[]
[]
[]
[]
[]
[]
[]
[]
[]
[]
[null,"Opmerking"]
[null,"Het onderzoek vindt plaats gedurende coronamaatregelen."]
[null,"Dit heeft mogelijk een effect op de resultaten."]
[]
[null,"Toelichting"]
[null,"Pers = personenwagens op daarvoor bestemde"]
[null,"          openbare plaatsen"]
[null,"Vracht = vrachtwagens op daarvoor bestemde"]
[null,"          parkeerplaatsen (middel- en zwaar vrachtverkeer)"]
[null,"Motor = geparkeerde motoren op openbare plaatsen"]
[null,"Obstakel / overig = obstakels of overige voertuigen"]
[null,"          geparkeerd op openbare plaatsen"]
[null,"Fout pers = personenwagens die fout geparkeerd staan"]
[null,"Fout vracht = vrachtwagens die fout geparkeerd staan"]
[null,"E-wagen = geparkeerde elektrisch voertuig bij een"]
[null,"          elektrisch oplaadpunt"]
[null,"Invalide = personenwagens en motoren op voor"]
[null,"          invalide personen bestemde parkeerplaats"]
[null,"Gestalde fietsen = alle gestalde fietsen op de"]
[null,"          daarvoor bestemde parkeerplaatsen"]

{"sheet":"95.Aalter","index":88,"n_rows":57,"n_cols":26,"rows_kept":57,"cut":false,"hidden":false,"merged":[[4,3,5,12],[4,16,5,16],[15,3,16,12]]}
[]
[null,"PARKEERONDERZOEK",null,"CARPOOLPARKINGS EN P+R PARKINGS"]
[null,95,null,{"$f":"B8 & \" - \"& TEXT(VLOOKUP(B3,Coordinaten!$A$2:$G$101,7,0),\"dddd d mmmm jjjj\")","v":"Carpool parking Aalter, Aalter - dinsdag 9 november 2021"}]
[null,{"$f":"VLOOKUP(B3,Coordinaten!$A$2:$G$101,6,0)","v":"51.0749724302438, 3.44756033702165"}]
[null,null,null,"BEZETTING  ",null,null,null,null,null,null,null,null,null,null,null,null,"OPMERKINGEN"]
[]
[null,"Onderzoeksgebied",null,"Datum","Geregistreerd tussen","Pers","Vracht","Motor","Obstakel / overig","Fout   pers","Fout Vracht","Totaal","E-wagen\nplaats","Invalidenplaats","Gestalde fietsen",null,null,null,null,null,{"$f":"F7","v":"Pers"},"Vracht","Motor","Obstakel / overig","Fout   pers","Fout Vracht"]
[null,{"$f":"VLOOKUP(B3,Coordinaten!$A$2:$G$101,3,0)&\", \"&VLOOKUP(B3,Coordinaten!$A$2:$G$101,5,0)","v":"Carpool parking Aalter, Aalter"},null,"2021-11-09","09:00 - 16:00u",27,0,0,0,1,0,28,0,0,2,null,0,null,{"$f":"D8","v":"2021-11-09"},{"$f":"E8","v":"09:00 - 16:00u"},{"$f":"IF(F8=0,NA(),F8/$L8)","v":0.9642857142857143},{"$f":"IF(G8=0,NA(),G8/$L8)","v":{"$error":"#N/A"}},{"$f":"IF(H8=0,NA(),H8/$L8)","v":{"$error":"#N/A"}},{"$error":"#N/A"},3.5714285714285712E-2,{"$error":"#N/A"}]
[null,{"$f":"\"Nabij kruispunt: \"&VLOOKUP(B3,Coordinaten!$A$2:$L$101,4,0)","v":"Nabij kruispunt: N37/N409/E40"},null,null,null,0.9642857142857143,"-","-","-",3.5714285714285712E-2,"-",1,null,null,null,null,0,null,{"$f":"D10","v":"2021-11-30"},{"$f":"E10","v":"19:00 - 02:00u"},{"$f":"IF(F10=0,NA(),F10/$L10)","v":1},{"$f":"IF(G10=0,NA(),G10/$L10)","v":{"$error":"#N/A"}},{"$error":"#N/A"},{"$error":"#N/A"},{"$error":"#N/A"},{"$error":"#N/A"}]
[null,null,null,"2021-11-30","19:00 - 02:00u",14,0,0,0,0,0,14,0,0,0,null,"Vanaf 20 november nieuwe coronamaatregelen, waaronder verplicht telewerk"]
[null,"Meting",null,null,null,1,"-","-","-","-","-",1,null,null,null,null,"Dinsdagavond 9 november niet bereikbaar, dus hermeting op 30 november"]
[null,{"$f":"\"Meetperiode: \"&TEXT(VLOOKUP(B3,Coordinaten!$A$2:$G$101,7,0),\"dddd d mmmm jjjj\")","v":"Meetperiode: dinsdag 9 november 2021"}]
[null,"Methodiek: Parkeerdrukmeting met waarnemers"]
[null,"In opdracht van: Vlaamse overheid"]
[null,"Uitgevoerd door: Dufec"]
[null,null,null,"VERDELING NAAR CATEGORIE"]
[null,"Locatie"]
[null,{"$f":"IF(B4=\"\",\"\",HYPERLINK(\"http://www.googlemaps.com/?q=\"&B4,\"Lat/Long: \"&B4))","v":"Lat/Long: 51.0749724302438, 3.44756033702165"}]
[]
[null,null,null,null,null,null,null,null,null,null,null,null,null,null,null,"Legenda"]
[null,null,null,null,null,null,null,null,null,null,null,null,null,null,null,null,"Personenwagen"]
[null,null,null,null,null,null,null,null,null,null,null,null,null,null,null,null,"Vracht"]
[null,null,null,null,null,null,null,null,null,null,null,null,null,null,null,null,"Motor"]
[null,null,null,null,null,null,null,null,null,null,null,null,null,null,null,null,"Obstakel / overig"]
[null,null,null,null,null,null,null,null,null,null,null,null,null,null,null,null,"Fout personenwagen"]
[null,null,null,null,null,null,null,null,null,null,null,null,null,null,null,null,"Fout Vracht"]
[]
[]
[]
[]
[]
[]
[]
[]
[]
[]
[]
[null,"Opmerking"]
[null,"Het onderzoek vindt plaats gedurende coronamaatregelen."]
[null,"Dit heeft mogelijk een effect op de resultaten."]
[]
[null,"Toelichting"]
[null,"Pers = personenwagens op daarvoor bestemde"]
[null,"          openbare plaatsen"]
[null,"Vracht = vrachtwagens op daarvoor bestemde"]
[null,"          parkeerplaatsen (middel- en zwaar vrachtverkeer)"]
[null,"Motor = geparkeerde motoren op openbare plaatsen"]
[null,"Obstakel / overig = obstakels of overige voertuigen"]
[null,"          geparkeerd op openbare plaatsen"]
[null,"Fout pers = personenwagens die fout geparkeerd staan"]
[null,"Fout vracht = vrachtwagens die fout geparkeerd staan"]
[null,"E-wagen = geparkeerde elektrisch voertuig bij een"]
[null,"          elektrisch oplaadpunt"]
[null,"Invalide = personenwagens en motoren op voor"]
[null,"          invalide personen bestemde parkeerplaats"]
[null,"Gestalde fietsen = alle gestalde fietsen op de"]
[null,"          daarvoor bestemde parkeerplaatsen"]

{"sheet":"96.De Pinte","index":89,"n_rows":57,"n_cols":26,"rows_kept":57,"cut":false,"hidden":false,"merged":[[4,3,5,12],[4,16,5,16],[15,3,16,12]]}
[]
[null,"PARKEERONDERZOEK",null,"CARPOOLPARKINGS EN P+R PARKINGS"]
[null,96,null,{"$f":"B8 & \" - \"& TEXT(VLOOKUP(B3,Coordinaten!$A$2:$G$101,7,0),\"dddd d mmmm jjjj\")","v":"Carpool parking De Pinte, De Pinte - dinsdag 23 november 2021"}]
[null,{"$f":"VLOOKUP(B3,Coordinaten!$A$2:$G$101,6,0)","v":"50.9860214680881, 3.67492574904555"}]
[null,null,null,"BEZETTING  ",null,null,null,null,null,null,null,null,null,null,null,null,"OPMERKINGEN"]
[]
[null,"Onderzoeksgebied",null,"Datum","Geregistreerd tussen","Pers","Vracht","Motor","Obstakel / overig","Fout   pers","Fout Vracht","Totaal","E-wagen\nplaats","Invalidenplaats","Gestalde fietsen",null,null,null,null,null,{"$f":"F7","v":"Pers"},"Vracht","Motor","Obstakel / overig","Fout   pers","Fout Vracht"]
[null,{"$f":"VLOOKUP(B3,Coordinaten!$A$2:$G$101,3,0)&\", \"&VLOOKUP(B3,Coordinaten!$A$2:$G$101,5,0)","v":"Carpool parking De Pinte, De Pinte"},null,"2021-11-23","09:00 - 16:00u",26,0,0,0,0,0,26,0,0,18,null,"Vanaf 20 november nieuwe coronamaatregelen, waaronder verplicht telewerk",null,{"$f":"D8","v":"2021-11-23"},{"$f":"E8","v":"09:00 - 16:00u"},{"$f":"IF(F8=0,NA(),F8/$L8)","v":1},{"$f":"IF(G8=0,NA(),G8/$L8)","v":{"$error":"#N/A"}},{"$f":"IF(H8=0,NA(),H8/$L8)","v":{"$error":"#N/A"}},{"$error":"#N/A"},{"$error":"#N/A"},{"$error":"#N/A"}]
[null,{"$f":"\"Nabij kruispunt: \"&VLOOKUP(B3,Coordinaten!$A$2:$L$101,4,0)","v":"Nabij kruispunt: E17/N60"},null,null,null,1,"-","-","-","-","-",1,null,null,null,null,0,null,{"$f":"D10","v":"2021-11-23"},{"$f":"E10","v":"19:00 - 02:00u"},{"$f":"IF(F10=0,NA(),F10/$L10)","v":0.9375},{"$f":"IF(G10=0,NA(),G10/$L10)","v":{"$error":"#N/A"}},{"$error":"#N/A"},{"$error":"#N/A"},6.25E-2,{"$error":"#N/A"}]
[null,null,null,"2021-11-23","19:00 - 02:00u",15,0,0,0,1,0,16,0,0,0,null,"Vanaf 20 november nieuwe coronamaatregelen, waaronder verplicht telewerk"]
[null,"Meting",null,null,null,0.9375,"-","-","-",6.25E-2,"-",1,null,null,null,null,0]
[null,{"$f":"\"Meetperiode: \"&TEXT(VLOOKUP(B3,Coordinaten!$A$2:$G$101,7,0),\"dddd d mmmm jjjj\")","v":"Meetperiode: dinsdag 23 november 2021"}]
[null,"Methodiek: Parkeerdrukmeting met waarnemers"]
[null,"In opdracht van: Vlaamse overheid"]
[null,"Uitgevoerd door: Dufec"]
[null,null,null,"VERDELING NAAR CATEGORIE"]
[null,"Locatie"]
[null,{"$f":"IF(B4=\"\",\"\",HYPERLINK(\"http://www.googlemaps.com/?q=\"&B4,\"Lat/Long: \"&B4))","v":"Lat/Long: 50.9860214680881, 3.67492574904555"}]
[]
[null,null,null,null,null,null,null,null,null,null,null,null,null,null,null,"Legenda"]
[null,null,null,null,null,null,null,null,null,null,null,null,null,null,null,null,"Personenwagen"]
[null,null,null,null,null,null,null,null,null,null,null,null,null,null,null,null,"Vracht"]
[null,null,null,null,null,null,null,null,null,null,null,null,null,null,null,null,"Motor"]
[null,null,null,null,null,null,null,null,null,null,null,null,null,null,null,null,"Obstakel / overig"]
[null,null,null,null,null,null,null,null,null,null,null,null,null,null,null,null,"Fout personenwagen"]
[null,null,null,null,null,null,null,null,null,null,null,null,null,null,null,null,"Fout Vracht"]
[]
[]
[]
[]
[]
[]
[]
[]
[]
[]
[]
[null,"Opmerking"]
[null,"Het onderzoek vindt plaats gedurende coronamaatregelen."]
[null,"Dit heeft mogelijk een effect op de resultaten."]
[]
[null,"Toelichting"]
[null,"Pers = personenwagens op daarvoor bestemde"]
[null,"          openbare plaatsen"]
[null,"Vracht = vrachtwagens op daarvoor bestemde"]
[null,"          parkeerplaatsen (middel- en zwaar vrachtverkeer)"]
[null,"Motor = geparkeerde motoren op openbare plaatsen"]
[null,"Obstakel / overig = obstakels of overige voertuigen"]
[null,"          geparkeerd op openbare plaatsen"]
[null,"Fout pers = personenwagens die fout geparkeerd staan"]
[null,"Fout vracht = vrachtwagens die fout geparkeerd staan"]
[null,"E-wagen = geparkeerde elektrisch voertuig bij een"]
[null,"          elektrisch oplaadpunt"]
[null,"Invalide = personenwagens en motoren op voor"]
[null,"          invalide personen bestemde parkeerplaats"]
[null,"Gestalde fietsen = alle gestalde fietsen op de"]
[null,"          daarvoor bestemde parkeerplaatsen"]

{"sheet":"97.Destelbergen","index":90,"n_rows":57,"n_cols":26,"rows_kept":57,"cut":false,"hidden":false,"merged":[[4,3,5,12],[4,16,5,16],[15,3,16,12]]}
[]
[null,"PARKEERONDERZOEK",null,"CARPOOLPARKINGS EN P+R PARKINGS"]
[null,97,null,{"$f":"B8 & \" - \"& TEXT(VLOOKUP(B3,Coordinaten!$A$2:$G$101,7,0),\"dddd d mmmm jjjj\")","v":"Carpool parking Destelbergen, Destelbergen - dinsdag 9 november 2021"}]
[null,{"$f":"VLOOKUP(B3,Coordinaten!$A$2:$G$101,6,0)","v":"51.0582508416525, 3.81284992030355"}]
[null,null,null,"BEZETTING  ",null,null,null,null,null,null,null,null,null,null,null,null,"OPMERKINGEN"]
[]
[null,"Onderzoeksgebied",null,"Datum","Geregistreerd tussen","Pers","Vracht","Motor","Obstakel / overig","Fout   pers","Fout Vracht","Totaal","E-wagen\nplaats","Invalidenplaats","Gestalde fietsen",null,null,null,null,null,{"$f":"F7","v":"Pers"},"Vracht","Motor","Obstakel / overig","Fout   pers","Fout Vracht"]
[null,{"$f":"VLOOKUP(B3,Coordinaten!$A$2:$G$101,3,0)&\", \"&VLOOKUP(B3,Coordinaten!$A$2:$G$101,5,0)","v":"Carpool parking Destelbergen, Destelbergen"},null,"2021-11-09","09:00 - 16:00u",24,1,0,0,0,0,25,0,0,4,null,0,null,{"$f":"D8","v":"2021-11-09"},{"$f":"E8","v":"09:00 - 16:00u"},{"$f":"IF(F8=0,NA(),F8/$L8)","v":0.96},{"$f":"IF(G8=0,NA(),G8/$L8)","v":0.04},{"$f":"IF(H8=0,NA(),H8/$L8)","v":{"$error":"#N/A"}},{"$error":"#N/A"},{"$error":"#N/A"},{"$error":"#N/A"}]
[null,{"$f":"\"Nabij kruispunt: \"&VLOOKUP(B3,Coordinaten!$A$2:$L$101,4,0)","v":"Nabij kruispunt: R4/N445"},null,null,null,0.96,0.04,"-","-","-","-",1,null,null,null,null,0,null,{"$f":"D10","v":"2021-11-09"},{"$f":"E10","v":"19:00 - 02:00u"},{"$f":"IF(F10=0,NA(),F10/$L10)","v":0.46666666666666667},{"$f":"IF(G10=0,NA(),G10/$L10)","v":0.26666666666666666},{"$error":"#N/A"},{"$error":"#N/A"},{"$error":"#N/A"},0.26666666666666666]
[null,null,null,"2021-11-09","19:00 - 02:00u",7,4,0,0,0,4,15,0,0,2,null,0]
[null,"Meting",null,null,null,0.46666666666666667,0.26666666666666666,"-","-","-",0.26666666666666666,1,null,null,null,null,0]
[null,{"$f":"\"Meetperiode: \"&TEXT(VLOOKUP(B3,Coordinaten!$A$2:$G$101,7,0),\"dddd d mmmm jjjj\")","v":"Meetperiode: dinsdag 9 november 2021"}]
[null,"Methodiek: Parkeerdrukmeting met waarnemers"]
[null,"In opdracht van: Vlaamse overheid"]
[null,"Uitgevoerd door: Dufec"]
[null,null,null,"VERDELING NAAR CATEGORIE"]
[null,"Locatie"]
[null,{"$f":"IF(B4=\"\",\"\",HYPERLINK(\"http://www.googlemaps.com/?q=\"&B4,\"Lat/Long: \"&B4))","v":"Lat/Long: 51.0582508416525, 3.81284992030355"}]
[]
[null,null,null,null,null,null,null,null,null,null,null,null,null,null,null,"Legenda"]
[null,null,null,null,null,null,null,null,null,null,null,null,null,null,null,null,"Personenwagen"]
[null,null,null,null,null,null,null,null,null,null,null,null,null,null,null,null,"Vracht"]
[null,null,null,null,null,null,null,null,null,null,null,null,null,null,null,null,"Motor"]
[null,null,null,null,null,null,null,null,null,null,null,null,null,null,null,null,"Obstakel / overig"]
[null,null,null,null,null,null,null,null,null,null,null,null,null,null,null,null,"Fout personenwagen"]
[null,null,null,null,null,null,null,null,null,null,null,null,null,null,null,null,"Fout Vracht"]
[]
[]
[]
[]
[]
[]
[]
[]
[]
[]
[]
[null,"Opmerking"]
[null,"Het onderzoek vindt plaats gedurende coronamaatregelen."]
[null,"Dit heeft mogelijk een effect op de resultaten."]
[]
[null,"Toelichting"]
[null,"Pers = personenwagens op daarvoor bestemde"]
[null,"          openbare plaatsen"]
[null,"Vracht = vrachtwagens op daarvoor bestemde"]
[null,"          parkeerplaatsen (middel- en zwaar vrachtverkeer)"]
[null,"Motor = geparkeerde motoren op openbare plaatsen"]
[null,"Obstakel / overig = obstakels of overige voertuigen"]
[null,"          geparkeerd op openbare plaatsen"]
[null,"Fout pers = personenwagens die fout geparkeerd staan"]
[null,"Fout vracht = vrachtwagens die fout geparkeerd staan"]
[null,"E-wagen = geparkeerde elektrisch voertuig bij een"]
[null,"          elektrisch oplaadpunt"]
[null,"Invalide = personenwagens en motoren op voor"]
[null,"          invalide personen bestemde parkeerplaats"]
[null,"Gestalde fietsen = alle gestalde fietsen op de"]
[null,"          daarvoor bestemde parkeerplaatsen"]

{"sheet":"98.Lokeren","index":91,"n_rows":57,"n_cols":26,"rows_kept":57,"cut":false,"hidden":false,"merged":[[4,3,5,12],[4,16,5,16],[15,3,16,12]]}
[]
[null,"PARKEERONDERZOEK",null,"CARPOOLPARKINGS EN P+R PARKINGS"]
[null,98,null,{"$f":"B8 & \" - \"& TEXT(VLOOKUP(B3,Coordinaten!$A$2:$G$101,7,0),\"dddd d mmmm jjjj\")","v":"Carpool parking Lokeren, Lokeren - dinsdag 9 november 2021"}]
[null,{"$f":"VLOOKUP(B3,Coordinaten!$A$2:$G$101,6,0)","v":"51.087592871792, 4.01991671115621"}]
[null,null,null,"BEZETTING  ",null,null,null,null,null,null,null,null,null,null,null,null,"OPMERKINGEN"]
[]
[null,"Onderzoeksgebied",null,"Datum","Geregistreerd tussen","Pers","Vracht","Motor","Obstakel / overig","Fout   pers","Fout Vracht","Totaal","E-wagen\nplaats","Invalidenplaats","Gestalde fietsen",null,null,null,null,null,{"$f":"F7","v":"Pers"},"Vracht","Motor","Obstakel / overig","Fout   pers","Fout Vracht"]
[null,{"$f":"VLOOKUP(B3,Coordinaten!$A$2:$G$101,3,0)&\", \"&VLOOKUP(B3,Coordinaten!$A$2:$G$101,5,0)","v":"Carpool parking Lokeren, Lokeren"},null,"2021-11-09","09:00 - 16:00u",49,0,0,0,1,1,51,0,0,1,null,0,null,{"$f":"D8","v":"2021-11-09"},{"$f":"E8","v":"09:00 - 16:00u"},{"$f":"IF(F8=0,NA(),F8/$L8)","v":0.96078431372549022},{"$f":"IF(G8=0,NA(),G8/$L8)","v":{"$error":"#N/A"}},{"$f":"IF(H8=0,NA(),H8/$L8)","v":{"$error":"#N/A"}},{"$error":"#N/A"},1.9607843137254902E-2,1.9607843137254902E-2]
[null,{"$f":"\"Nabij kruispunt: \"&VLOOKUP(B3,Coordinaten!$A$2:$L$101,4,0)","v":"Nabij kruispunt: E17/N47 - uitrit 12"},null,null,null,0.96078431372549022,"-","-","-",1.9607843137254902E-2,1.9607843137254902E-2,1,null,null,null,null,0,null,{"$f":"D10","v":"2021-11-09"},{"$f":"E10","v":"19:00 - 02:00u"},{"$f":"IF(F10=0,NA(),F10/$L10)","v":1},{"$f":"IF(G10=0,NA(),G10/$L10)","v":{"$error":"#N/A"}},{"$error":"#N/A"},{"$error":"#N/A"},{"$error":"#N/A"},{"$error":"#N/A"}]
[null,null,null,"2021-11-09","19:00 - 02:00u",28,0,0,0,0,0,28,0,0,0,null,0]
[null,"Meting",null,null,null,1,"-","-","-","-","-",1,null,null,null,null,0]
[null,{"$f":"\"Meetperiode: \"&TEXT(VLOOKUP(B3,Coordinaten!$A$2:$G$101,7,0),\"dddd d mmmm jjjj\")","v":"Meetperiode: dinsdag 9 november 2021"}]
[null,"Methodiek: Parkeerdrukmeting met waarnemers"]
[null,"In opdracht van: Vlaamse overheid"]
[null,"Uitgevoerd door: Dufec"]
[null,null,null,"VERDELING NAAR CATEGORIE"]
[null,"Locatie"]
[null,{"$f":"IF(B4=\"\",\"\",HYPERLINK(\"http://www.googlemaps.com/?q=\"&B4,\"Lat/Long: \"&B4))","v":"Lat/Long: 51.087592871792, 4.01991671115621"}]
[]
[null,null,null,null,null,null,null,null,null,null,null,null,null,null,null,"Legenda"]
[null,null,null,null,null,null,null,null,null,null,null,null,null,null,null,null,"Personenwagen"]
[null,null,null,null,null,null,null,null,null,null,null,null,null,null,null,null,"Vracht"]
[null,null,null,null,null,null,null,null,null,null,null,null,null,null,null,null,"Motor"]
[null,null,null,null,null,null,null,null,null,null,null,null,null,null,null,null,"Obstakel / overig"]
[null,null,null,null,null,null,null,null,null,null,null,null,null,null,null,null,"Fout personenwagen"]
[null,null,null,null,null,null,null,null,null,null,null,null,null,null,null,null,"Fout Vracht"]
[]
[]
[]
[]
[]
[]
[]
[]
[]
[]
[]
[null,"Opmerking"]
[null,"Het onderzoek vindt plaats gedurende coronamaatregelen."]
[null,"Dit heeft mogelijk een effect op de resultaten."]
[]
[null,"Toelichting"]
[null,"Pers = personenwagens op daarvoor bestemde"]
[null,"          openbare plaatsen"]
[null,"Vracht = vrachtwagens op daarvoor bestemde"]
[null,"          parkeerplaatsen (middel- en zwaar vrachtverkeer)"]
[null,"Motor = geparkeerde motoren op openbare plaatsen"]
[null,"Obstakel / overig = obstakels of overige voertuigen"]
[null,"          geparkeerd op openbare plaatsen"]
[null,"Fout pers = personenwagens die fout geparkeerd staan"]
[null,"Fout vracht = vrachtwagens die fout geparkeerd staan"]
[null,"E-wagen = geparkeerde elektrisch voertuig bij een"]
[null,"          elektrisch oplaadpunt"]
[null,"Invalide = personenwagens en motoren op voor"]
[null,"          invalide personen bestemde parkeerplaats"]
[null,"Gestalde fietsen = alle gestalde fietsen op de"]
[null,"          daarvoor bestemde parkeerplaatsen"]

{"sheet":"99.Massenhoven","index":92,"n_rows":57,"n_cols":26,"rows_kept":57,"cut":false,"hidden":false,"merged":[[4,3,5,12],[4,16,5,16],[15,3,16,12]]}
[]
[null,"PARKEERONDERZOEK",null,"CARPOOLPARKINGS EN P+R PARKINGS"]
[null,99,null,{"$f":"B8 & \" - \"& TEXT(VLOOKUP(B3,Coordinaten!$A$2:$G$101,7,0),\"dddd d mmmm jjjj\")","v":"P+R parking Massenhoven, Massenhoven - donderdag 18 november 2021"}]
[null,{"$f":"VLOOKUP(B3,Coordinaten!$A$2:$G$101,6,0)","v":"51.194333453788, 4.64222375753947"}]
[null,null,null,"BEZETTING  ",null,null,null,null,null,null,null,null,null,null,null,null,"OPMERKINGEN"]
[]
[null,"Onderzoeksgebied",null,"Datum","Geregistreerd tussen","Pers","Vracht","Motor","Obstakel / overig","Fout   pers","Fout Vracht","Totaal","E-wagen\nplaats","Invalidenplaats","Gestalde fietsen",null,null,null,null,null,{"$f":"F7","v":"Pers"},"Vracht","Motor","Obstakel / overig","Fout   pers","Fout Vracht"]
[null,{"$f":"VLOOKUP(B3,Coordinaten!$A$2:$G$101,3,0)&\", \"&VLOOKUP(B3,Coordinaten!$A$2:$G$101,5,0)","v":"P+R parking Massenhoven, Massenhoven"},null,"2021-11-18","09:00 - 16:00u",0,0,0,0,0,0,0,0,0,0,null,"Niet te bereiken",null,{"$f":"D8","v":"2021-11-18"},{"$f":"E8","v":"09:00 - 16:00u"},{"$f":"IF(F8=0,NA(),F8/$L8)","v":{"$error":"#N/A"}},{"$f":"IF(G8=0,NA(),G8/$L8)","v":{"$error":"#N/A"}},{"$f":"IF(H8=0,NA(),H8/$L8)","v":{"$error":"#N/A"}},{"$error":"#N/A"},{"$error":"#N/A"},{"$error":"#N/A"}]
[null,{"$f":"\"Nabij kruispunt: \"&VLOOKUP(B3,Coordinaten!$A$2:$L$101,4,0)","v":"Nabij kruispunt: E313/N14"},null,null,null,"-","-","-","-","-","-","-",null,null,null,null,0,null,{"$f":"D10","v":"2021-11-18"},{"$f":"E10","v":"19:00 - 02:00u"},{"$f":"IF(F10=0,NA(),F10/$L10)","v":{"$error":"#N/A"}},{"$f":"IF(G10=0,NA(),G10/$L10)","v":{"$error":"#N/A"}},{"$error":"#N/A"},{"$error":"#N/A"},{"$error":"#N/A"},{"$error":"#N/A"}]
[null,null,null,"2021-11-18","19:00 - 02:00u",0,0,0,0,0,0,0,0,0,0,null,"Niet te bereiken"]
[null,"Meting",null,null,null,"-","-","-","-","-","-","-",null,null,null,null,0]
[null,{"$f":"\"Meetperiode: \"&TEXT(VLOOKUP(B3,Coordinaten!$A$2:$G$101,7,0),\"dddd d mmmm jjjj\")","v":"Meetperiode: donderdag 18 november 2021"}]
[null,"Methodiek: Parkeerdrukmeting met waarnemers"]
[null,"In opdracht van: Vlaamse overheid"]
[null,"Uitgevoerd door: Dufec"]
[null,null,null,"VERDELING NAAR CATEGORIE"]
[null,"Locatie"]
[null,{"$f":"IF(B4=\"\",\"\",HYPERLINK(\"http://www.googlemaps.com/?q=\"&B4,\"Lat/Long: \"&B4))","v":"Lat/Long: 51.194333453788, 4.64222375753947"}]
[]
[null,null,null,null,null,null,null,null,null,null,null,null,null,null,null,"Legenda"]
[null,null,null,null,null,null,null,null,null,null,null,null,null,null,null,null,"Personenwagen"]
[null,null,null,null,null,null,null,null,null,null,null,null,null,null,null,null,"Vracht"]
[null,null,null,null,null,null,null,null,null,null,null,null,null,null,null,null,"Motor"]
[null,null,null,null,null,null,null,null,null,null,null,null,null,null,null,null,"Obstakel / overig"]
[null,null,null,null,null,null,null,null,null,null,null,null,null,null,null,null,"Fout personenwagen"]
[null,null,null,null,null,null,null,null,null,null,null,null,null,null,null,null,"Fout Vracht"]
[]
[]
[]
[]
[]
[]
[]
[]
[]
[]
[]
[null,"Opmerking"]
[null,"Het onderzoek vindt plaats gedurende coronamaatregelen."]
[null,"Dit heeft mogelijk een effect op de resultaten."]
[]
[null,"Toelichting"]
[null,"Pers = personenwagens op daarvoor bestemde"]
[null,"          openbare plaatsen"]
[null,"Vracht = vrachtwagens op daarvoor bestemde"]
[null,"          parkeerplaatsen (middel- en zwaar vrachtverkeer)"]
[null,"Motor = geparkeerde motoren op openbare plaatsen"]
[null,"Obstakel / overig = obstakels of overige voertuigen"]
[null,"          geparkeerd op openbare plaatsen"]
[null,"Fout pers = personenwagens die fout geparkeerd staan"]
[null,"Fout vracht = vrachtwagens die fout geparkeerd staan"]
[null,"E-wagen = geparkeerde elektrisch voertuig bij een"]
[null,"          elektrisch oplaadpunt"]
[null,"Invalide = personenwagens en motoren op voor"]
[null,"          invalide personen bestemde parkeerplaats"]
[null,"Gestalde fietsen = alle gestalde fietsen op de"]
[null,"          daarvoor bestemde parkeerplaatsen"]

{"sheet":"100.Tongeren","index":93,"n_rows":57,"n_cols":26,"rows_kept":57,"cut":false,"hidden":false,"merged":[[4,3,5,12],[4,16,5,16],[15,3,16,12]]}
[]
[null,"PARKEERONDERZOEK",null,"CARPOOLPARKINGS EN P+R PARKINGS"]
[null,100,null,{"$f":"B8 & \" - \"& TEXT(VLOOKUP(B3,Coordinaten!$A$2:$G$101,7,0),\"dddd d mmmm jjjj\")","v":"Carpool parking Tongeren, Tongeren - dinsdag 16 november 2021"}]
[null,{"$f":"VLOOKUP(B3,Coordinaten!$A$2:$G$101,6,0)","v":"50.7911487169427, 5.52935513780375"}]
[null,null,null,"BEZETTING  ",null,null,null,null,null,null,null,null,null,null,null,null,"OPMERKINGEN"]
[]
[null,"Onderzoeksgebied",null,"Datum","Geregistreerd tussen","Pers","Vracht","Motor","Obstakel / overig","Fout   pers","Fout Vracht","Totaal","E-wagen\nplaats","Invalidenplaats","Gestalde fietsen",null,null,null,null,null,{"$f":"F7","v":"Pers"},"Vracht","Motor","Obstakel / overig","Fout   pers","Fout Vracht"]
[null,{"$f":"VLOOKUP(B3,Coordinaten!$A$2:$G$101,3,0)&\", \"&VLOOKUP(B3,Coordinaten!$A$2:$G$101,5,0)","v":"Carpool parking Tongeren, Tongeren"},null,"2021-11-16","09:00 - 16:00u",49,0,0,4,0,3,56,0,0,0,null,"Obstakel: 4 parkeerplaatsen voor bouwvakkers",null,{"$f":"D8","v":"2021-11-16"},{"$f":"E8","v":"09:00 - 16:00u"},{"$f":"IF(F8=0,NA(),F8/$L8)","v":0.875},{"$f":"IF(G8=0,NA(),G8/$L8)","v":{"$error":"#N/A"}},{"$f":"IF(H8=0,NA(),H8/$L8)","v":{"$error":"#N/A"}},7.1428571428571425E-2,{"$error":"#N/A"},5.3571428571428568E-2]
[null,{"$f":"\"Nabij kruispunt: \"&VLOOKUP(B3,Coordinaten!$A$2:$L$101,4,0)","v":"Nabij kruispunt: N79 / E313 (rotonde)"},null,null,null,0.875,"-","-",7.1428571428571425E-2,"-",5.3571428571428568E-2,1,null,null,null,null,0,null,{"$f":"D10","v":"2021-11-16"},{"$f":"E10","v":"19:00 - 02:00u"},{"$f":"IF(F10=0,NA(),F10/$L10)","v":0.5},{"$f":"IF(G10=0,NA(),G10/$L10)","v":{"$error":"#N/A"}},{"$error":"#N/A"},0.4,{"$error":"#N/A"},0.1]
[null,null,null,"2021-11-16","19:00 - 02:00u",5,0,0,4,0,1,10,0,0,0,null,"Obstakel: 4 parkeerplaatsen voor bouwvakkers"]
[null,"Meting",null,null,null,0.5,"-","-",0.4,"-",0.1,1,null,null,null,null,0]
[null,{"$f":"\"Meetperiode: \"&TEXT(VLOOKUP(B3,Coordinaten!$A$2:$G$101,7,0),\"dddd d mmmm jjjj\")","v":"Meetperiode: dinsdag 16 november 2021"}]
[null,"Methodiek: Parkeerdrukmeting met waarnemers"]
[null,"In opdracht van: Vlaamse overheid"]
[null,"Uitgevoerd door: Dufec"]
[null,null,null,"VERDELING NAAR CATEGORIE"]
[null,"Locatie"]
[null,{"$f":"IF(B4=\"\",\"\",HYPERLINK(\"http://www.googlemaps.com/?q=\"&B4,\"Lat/Long: \"&B4))","v":"Lat/Long: 50.7911487169427, 5.52935513780375"}]
[]
[null,null,null,null,null,null,null,null,null,null,null,null,null,null,null,"Legenda"]
[null,null,null,null,null,null,null,null,null,null,null,null,null,null,null,null,"Personenwagen"]
[null,null,null,null,null,null,null,null,null,null,null,null,null,null,null,null,"Vracht"]
[null,null,null,null,null,null,null,null,null,null,null,null,null,null,null,null,"Motor"]
[null,null,null,null,null,null,null,null,null,null,null,null,null,null,null,null,"Obstakel / overig"]
[null,null,null,null,null,null,null,null,null,null,null,null,null,null,null,null,"Fout personenwagen"]
[null,null,null,null,null,null,null,null,null,null,null,null,null,null,null,null,"Fout Vracht"]
[]
[]
[]
[]
[]
[]
[]
[]
[]
[]
[]
[null,"Opmerking"]
[null,"Het onderzoek vindt plaats gedurende coronamaatregelen."]
[null,"Dit heeft mogelijk een effect op de resultaten."]
[]
[null,"Toelichting"]
[null,"Pers = personenwagens op daarvoor bestemde"]
[null,"          openbare plaatsen"]
[null,"Vracht = vrachtwagens op daarvoor bestemde"]
[null,"          parkeerplaatsen (middel- en zwaar vrachtverkeer)"]
[null,"Motor = geparkeerde motoren op openbare plaatsen"]
[null,"Obstakel / overig = obstakels of overige voertuigen"]
[null,"          geparkeerd op openbare plaatsen"]
[null,"Fout pers = personenwagens die fout geparkeerd staan"]
[null,"Fout vracht = vrachtwagens die fout geparkeerd staan"]
[null,"E-wagen = geparkeerde elektrisch voertuig bij een"]
[null,"          elektrisch oplaadpunt"]
[null,"Invalide = personenwagens en motoren op voor"]
[null,"          invalide personen bestemde parkeerplaats"]
[null,"Gestalde fietsen = alle gestalde fietsen op de"]
[null,"          daarvoor bestemde parkeerplaatsen"]

{"sheet":"Coordinaten","index":94,"n_rows":101,"n_cols":18,"rows_kept":101,"cut":false,"hidden":true,"merged":[]}
["Locatie","Naam1","naam2","Nabij kruispunt","Plaats","Coordinaten","Datum","URL","1e deel","3edeel","2edeel","4edeel",null,null,null,null,null,"ID"]
[1,"Kemzeke-Zuid","Carpool parking Kemzeke-Zuid","N49 / N403","Stekene","51.226907, 4.063425","2021-11-09","https://api.mapbox.com/styles/v1/heinv/cj1c3sqp500di2rqmtxr5l2jn/static/4.063425,51.226907,13,0/400x400?access_token=pk.eyJ1IjoiaGVpbnYiLCJhIjoiNGEzYjEwYjY5MjM3YjQxNTZlZmY5MjE5YTViZWFiNjYifQ.dwA82fqv0CeVGxFMr30KIg","https://api.mapbox.com/styles/v1/heinv/cj1c3sqp500di2rqmtxr5l2jn/static/","51.226907","4.063425",",13,0/400x400?access_token=pk.eyJ1IjoiaGVpbnYiLCJhIjoiNGEzYjEwYjY5MjM3YjQxNTZlZmY5MjE5YTViZWFiNjYifQ.dwA82fqv0CeVGxFMr30KIg",null,null,null,null,null,1]
[2,"Halle-Dassenveld","Carpool parking Halle-Dassenveld","N7 / A8","Halle","50.726346, 4.217220","2021-11-23","https://api.mapbox.com/styles/v1/heinv/cj1c3sqp500di2rqmtxr5l2jn/static/4.217220,50.726346,13,0/400x400?access_token=pk.eyJ1IjoiaGVpbnYiLCJhIjoiNGEzYjEwYjY5MjM3YjQxNTZlZmY5MjE5YTViZWFiNjYifQ.dwA82fqv0CeVGxFMr30KIg","https://api.mapbox.com/styles/v1/heinv/cj1c3sqp500di2rqmtxr5l2jn/static/","50.726346","4.217220",",13,0/400x400?access_token=pk.eyJ1IjoiaGVpbnYiLCJhIjoiNGEzYjEwYjY5MjM3YjQxNTZlZmY5MjE5YTViZWFiNjYifQ.dwA82fqv0CeVGxFMr30KIg",null,null,null,null,null,2]
[3,"Winksele","Carpool parking Winksele","Stuiverstraat / N2","Herent","50.885324, 4.672071","2021-11-16","https://api.mapbox.com/styles/v1/heinv/cj1c3sqp500di2rqmtxr5l2jn/static/4.672071,50.885324,13,0/400x400?access_token=pk.eyJ1IjoiaGVpbnYiLCJhIjoiNGEzYjEwYjY5MjM3YjQxNTZlZmY5MjE5YTViZWFiNjYifQ.dwA82fqv0CeVGxFMr30KIg","https://api.mapbox.com/styles/v1/heinv/cj1c3sqp500di2rqmtxr5l2jn/static/","50.885324","4.672071",",13,0/400x400?access_token=pk.eyJ1IjoiaGVpbnYiLCJhIjoiNGEzYjEwYjY5MjM3YjQxNTZlZmY5MjE5YTViZWFiNjYifQ.dwA82fqv0CeVGxFMr30KIg",null,null,null,null,null,3]
[4,"Herent","Carpool parking Herent","N26 / A2","Leuven","50.893869, 4.689409","2021-11-16","https://api.mapbox.com/styles/v1/heinv/cj1c3sqp500di2rqmtxr5l2jn/static/4.689409,50.893869,13,0/400x400?access_token=pk.eyJ1IjoiaGVpbnYiLCJhIjoiNGEzYjEwYjY5MjM3YjQxNTZlZmY5MjE5YTViZWFiNjYifQ.dwA82fqv0CeVGxFMr30KIg","https://api.mapbox.com/styles/v1/heinv/cj1c3sqp500di2rqmtxr5l2jn/static/","50.893869","4.689409",",13,0/400x400?access_token=pk.eyJ1IjoiaGVpbnYiLCJhIjoiNGEzYjEwYjY5MjM3YjQxNTZlZmY5MjE5YTViZWFiNjYifQ.dwA82fqv0CeVGxFMr30KIg",null,null,null,null,null,4]
[5,"Bekkevoort","Carpool parking Bekkevoort","N2 / A2","Bekkevoort","50.952219, 4.998683","2021-11-16","https://api.mapbox.com/styles/v1/heinv/cj1c3sqp500di2rqmtxr5l2jn/static/4.998683,50.952219,13,0/400x400?access_token=pk.eyJ1IjoiaGVpbnYiLCJhIjoiNGEzYjEwYjY5MjM3YjQxNTZlZmY5MjE5YTViZWFiNjYifQ.dwA82fqv0CeVGxFMr30KIg","https://api.mapbox.com/styles/v1/heinv/cj1c3sqp500di2rqmtxr5l2jn/static/","50.952219","4.998683",",13,0/400x400?access_token=pk.eyJ1IjoiaGVpbnYiLCJhIjoiNGEzYjEwYjY5MjM3YjQxNTZlZmY5MjE5YTViZWFiNjYifQ.dwA82fqv0CeVGxFMr30KIg",null,null,null,null,null,5]
[6,"Overijse","Carpool parking Overijse","Kerkeweg / N253","Overijse","50.755140, 4.526412","2021-11-18","https://api.mapbox.com/styles/v1/heinv/cj1c3sqp500di2rqmtxr5l2jn/static/4.526412,50.755140,13,0/400x400?access_token=pk.eyJ1IjoiaGVpbnYiLCJhIjoiNGEzYjEwYjY5MjM3YjQxNTZlZmY5MjE5YTViZWFiNjYifQ.dwA82fqv0CeVGxFMr30KIg","https://api.mapbox.com/styles/v1/heinv/cj1c3sqp500di2rqmtxr5l2jn/static/","50.755140","4.526412",",13,0/400x400?access_token=pk.eyJ1IjoiaGVpbnYiLCJhIjoiNGEzYjEwYjY5MjM3YjQxNTZlZmY5MjE5YTViZWFiNjYifQ.dwA82fqv0CeVGxFMr30KIg",null,null,null,null,null,6]
[7,"St. Michiels","Carpool parking St. Michiels","N31 / N32","Brugge","51.194190, 3.197624","2021-11-09","https://api.mapbox.com/styles/v1/heinv/cj1c3sqp500di2rqmtxr5l2jn/static/3.197624,51.194190,13,0/400x400?access_token=pk.eyJ1IjoiaGVpbnYiLCJhIjoiNGEzYjEwYjY5MjM3YjQxNTZlZmY5MjE5YTViZWFiNjYifQ.dwA82fqv0CeVGxFMr30KIg","https://api.mapbox.com/styles/v1/heinv/cj1c3sqp500di2rqmtxr5l2jn/static/","51.194190","3.197624",",13,0/400x400?access_token=pk.eyJ1IjoiaGVpbnYiLCJhIjoiNGEzYjEwYjY5MjM3YjQxNTZlZmY5MjE5YTViZWFiNjYifQ.dwA82fqv0CeVGxFMr30KIg",null,null,null,null,null,7]
[8,"Izegem","Carpool parking Izegem","N382c / Schaapbruggestraat","Roeselare","50.940676, 3.160323","2021-11-23","https://api.mapbox.com/styles/v1/heinv/cj1c3sqp500di2rqmtxr5l2jn/static/3.160323,50.940676,13,0/400x400?access_token=pk.eyJ1IjoiaGVpbnYiLCJhIjoiNGEzYjEwYjY5MjM3YjQxNTZlZmY5MjE5YTViZWFiNjYifQ.dwA82fqv0CeVGxFMr30KIg","https://api.mapbox.com/styles/v1/heinv/cj1c3sqp500di2rqmtxr5l2jn/static/","50.940676","3.160323",",13,0/400x400?access_token=pk.eyJ1IjoiaGVpbnYiLCJhIjoiNGEzYjEwYjY5MjM3YjQxNTZlZmY5MjE5YTViZWFiNjYifQ.dwA82fqv0CeVGxFMr30KIg",null,null,null,null,null,8]
[9,"Torhout","Carpool parking Torhout","R34 / Keibergstraat","Torhout","51.077896, 3.118743","2021-11-23","https://api.mapbox.com/styles/v1/heinv/cj1c3sqp500di2rqmtxr5l2jn/static/3.118743,51.077896,13,0/400x400?access_token=pk.eyJ1IjoiaGVpbnYiLCJhIjoiNGEzYjEwYjY5MjM3YjQxNTZlZmY5MjE5YTViZWFiNjYifQ.dwA82fqv0CeVGxFMr30KIg","https://api.mapbox.com/styles/v1/heinv/cj1c3sqp500di2rqmtxr5l2jn/static/","51.077896","3.118743",",13,0/400x400?access_token=pk.eyJ1IjoiaGVpbnYiLCJhIjoiNGEzYjEwYjY5MjM3YjQxNTZlZmY5MjE5YTViZWFiNjYifQ.dwA82fqv0CeVGxFMr30KIg",null,null,null,null,null,9]
[10,"Houthalen","Carpool parking Houthalen","N715 / A2","Houthalen-Helchteren","51.015552, 5.371400","2021-11-16","https://api.mapbox.com/styles/v1/heinv/cj1c3sqp500di2rqmtxr5l2jn/static/5.371400,51.015552,13,0/400x400?access_token=pk.eyJ1IjoiaGVpbnYiLCJhIjoiNGEzYjEwYjY5MjM3YjQxNTZlZmY5MjE5YTViZWFiNjYifQ.dwA82fqv0CeVGxFMr30KIg","https://api.mapbox.com/styles/v1/heinv/cj1c3sqp500di2rqmtxr5l2jn/static/","51.015552","5.371400",",13,0/400x400?access_token=pk.eyJ1IjoiaGVpbnYiLCJhIjoiNGEzYjEwYjY5MjM3YjQxNTZlZmY5MjE5YTViZWFiNjYifQ.dwA82fqv0CeVGxFMr30KIg",null,null,null,null,null,10]
[11,"Diepenbeek","Carpool parking Diepenbeek","N76 / A13","Diepenbeek","50.894087, 5.417912","2021-11-16","https://api.mapbox.com/styles/v1/heinv/cj1c3sqp500di2rqmtxr5l2jn/static/5.417912,50.894087,13,0/400x400?access_token=pk.eyJ1IjoiaGVpbnYiLCJhIjoiNGEzYjEwYjY5MjM3YjQxNTZlZmY5MjE5YTViZWFiNjYifQ.dwA82fqv0CeVGxFMr30KIg","https://api.mapbox.com/styles/v1/heinv/cj1c3sqp500di2rqmtxr5l2jn/static/","50.894087","5.417912",",13,0/400x400?access_token=pk.eyJ1IjoiaGVpbnYiLCJhIjoiNGEzYjEwYjY5MjM3YjQxNTZlZmY5MjE5YTViZWFiNjYifQ.dwA82fqv0CeVGxFMr30KIg",null,null,null,null,null,11]
[12,"Wommelgem-Zuid","P+R parking Wommelgem-Zuid","R11 / A13","Wommelgem","51.210463, 4.493799","2021-11-18","https://api.mapbox.com/styles/v1/heinv/cj1c3sqp500di2rqmtxr5l2jn/static/4.493799,51.210463,13,0/400x400?access_token=pk.eyJ1IjoiaGVpbnYiLCJhIjoiNGEzYjEwYjY5MjM3YjQxNTZlZmY5MjE5YTViZWFiNjYifQ.dwA82fqv0CeVGxFMr30KIg","https://api.mapbox.com/styles/v1/heinv/cj1c3sqp500di2rqmtxr5l2jn/static/","51.210463","4.493799",",13,0/400x400?access_token=pk.eyJ1IjoiaGVpbnYiLCJhIjoiNGEzYjEwYjY5MjM3YjQxNTZlZmY5MjE5YTViZWFiNjYifQ.dwA82fqv0CeVGxFMr30KIg",null,null,null,null,null,12]
[13,"Minitaria","Carpool parking Minitaria","N3 / R27","Tienen","50.799170, 4.970858","2021-11-16","https://api.mapbox.com/styles/v1/heinv/cj1c3sqp500di2rqmtxr5l2jn/static/4.970858,50.799170,13,0/400x400?access_token=pk.eyJ1IjoiaGVpbnYiLCJhIjoiNGEzYjEwYjY5MjM3YjQxNTZlZmY5MjE5YTViZWFiNjYifQ.dwA82fqv0CeVGxFMr30KIg","https://api.mapbox.com/styles/v1/heinv/cj1c3sqp500di2rqmtxr5l2jn/static/","50.799170","4.970858",",13,0/400x400?access_token=pk.eyJ1IjoiaGVpbnYiLCJhIjoiNGEzYjEwYjY5MjM3YjQxNTZlZmY5MjE5YTViZWFiNjYifQ.dwA82fqv0CeVGxFMr30KIg",null,null,null,null,null,13]
[14,"Hakendover","Carpool parking Hakendover","N3 / R27","Tienen","50.798982, 4.973467","2021-11-16","https://api.mapbox.com/styles/v1/heinv/cj1c3sqp500di2rqmtxr5l2jn/static/4.973467,50.798982,13,0/400x400?access_token=pk.eyJ1IjoiaGVpbnYiLCJhIjoiNGEzYjEwYjY5MjM3YjQxNTZlZmY5MjE5YTViZWFiNjYifQ.dwA82fqv0CeVGxFMr30KIg","https://api.mapbox.com/styles/v1/heinv/cj1c3sqp500di2rqmtxr5l2jn/static/","50.798982","4.973467",",13,0/400x400?access_token=pk.eyJ1IjoiaGVpbnYiLCJhIjoiNGEzYjEwYjY5MjM3YjQxNTZlZmY5MjE5YTViZWFiNjYifQ.dwA82fqv0CeVGxFMr30KIg",null,null,null,null,null,14]
[15,"Kontich","Carpool parking Kontich","N171 / A1","Kontich","51.126274, 4.432122","2021-11-18","https://api.mapbox.com/styles/v1/heinv/cj1c3sqp500di2rqmtxr5l2jn/static/4.432122,51.126274,13,0/400x400?access_token=pk.eyJ1IjoiaGVpbnYiLCJhIjoiNGEzYjEwYjY5MjM3YjQxNTZlZmY5MjE5YTViZWFiNjYifQ.dwA82fqv0CeVGxFMr30KIg","https://api.mapbox.com/styles/v1/heinv/cj1c3sqp500di2rqmtxr5l2jn/static/","51.126274","4.432122",",13,0/400x400?access_token=pk.eyJ1IjoiaGVpbnYiLCJhIjoiNGEzYjEwYjY5MjM3YjQxNTZlZmY5MjE5YTViZWFiNjYifQ.dwA82fqv0CeVGxFMr30KIg",null,null,null,null,null,15]
[16,"Breendonk (Puurs)","Carpool parking Breendonk (Puurs)","N16 / N183","Puurs","51.060329, 4.334348","2021-11-18","https://api.mapbox.com/styles/v1/heinv/cj1c3sqp500di2rqmtxr5l2jn/static/4.334348,51.060329,13,0/400x400?access_token=pk.eyJ1IjoiaGVpbnYiLCJhIjoiNGEzYjEwYjY5MjM3YjQxNTZlZmY5MjE5YTViZWFiNjYifQ.dwA82fqv0CeVGxFMr30KIg","https://api.mapbox.com/styles/v1/heinv/cj1c3sqp500di2rqmtxr5l2jn/static/","51.060329","4.334348",",13,0/400x400?access_token=pk.eyJ1IjoiaGVpbnYiLCJhIjoiNGEzYjEwYjY5MjM3YjQxNTZlZmY5MjE5YTViZWFiNjYifQ.dwA82fqv0CeVGxFMr30KIg",null,null,null,null,null,16]
[17,"Hasselt-Zuid","Carpool parking Hasselt-Zuid","N80 / A13","Hasselt","50.915675, 5.322639","2021-11-16","https://api.mapbox.com/styles/v1/heinv/cj1c3sqp500di2rqmtxr5l2jn/static/5.322639,50.915675,13,0/400x400?access_token=pk.eyJ1IjoiaGVpbnYiLCJhIjoiNGEzYjEwYjY5MjM3YjQxNTZlZmY5MjE5YTViZWFiNjYifQ.dwA82fqv0CeVGxFMr30KIg","https://api.mapbox.com/styles/v1/heinv/cj1c3sqp500di2rqmtxr5l2jn/static/","50.915675","5.322639",",13,0/400x400?access_token=pk.eyJ1IjoiaGVpbnYiLCJhIjoiNGEzYjEwYjY5MjM3YjQxNTZlZmY5MjE5YTViZWFiNjYifQ.dwA82fqv0CeVGxFMr30KIg",null,null,null,null,null,17]
[18,"Herentals-West","Carpool parking Herentals-West","N13 / A13","Grobbendonk","51.175093, 4.761781","2021-11-18","https://api.mapbox.com/styles/v1/heinv/cj1c3sqp500di2rqmtxr5l2jn/static/4.761781,51.175093,13,0/400x400?access_token=pk.eyJ1IjoiaGVpbnYiLCJhIjoiNGEzYjEwYjY5MjM3YjQxNTZlZmY5MjE5YTViZWFiNjYifQ.dwA82fqv0CeVGxFMr30KIg","https://api.mapbox.com/styles/v1/heinv/cj1c3sqp500di2rqmtxr5l2jn/static/","51.175093","4.761781",",13,0/400x400?access_token=pk.eyJ1IjoiaGVpbnYiLCJhIjoiNGEzYjEwYjY5MjM3YjQxNTZlZmY5MjE5YTViZWFiNjYifQ.dwA82fqv0CeVGxFMr30KIg",null,null,null,null,null,18]
[19,"Rumst","Carpool parking Rumst","N1c / A1","Rumst","51.085447, 4.444751","2021-11-18","https://api.mapbox.com/styles/v1/heinv/cj1c3sqp500di2rqmtxr5l2jn/static/4.444751,51.085447,13,0/400x400?access_token=pk.eyJ1IjoiaGVpbnYiLCJhIjoiNGEzYjEwYjY5MjM3YjQxNTZlZmY5MjE5YTViZWFiNjYifQ.dwA82fqv0CeVGxFMr30KIg","https://api.mapbox.com/styles/v1/heinv/cj1c3sqp500di2rqmtxr5l2jn/static/","51.085447","4.444751",",13,0/400x400?access_token=pk.eyJ1IjoiaGVpbnYiLCJhIjoiNGEzYjEwYjY5MjM3YjQxNTZlZmY5MjE5YTViZWFiNjYifQ.dwA82fqv0CeVGxFMr30KIg",null,null,null,null,null,19]
[20,"Paal","Carpool parking Paal","N29 / A13","Beringen","51.043187, 5.186305","2021-11-18","https://api.mapbox.com/styles/v1/heinv/cj1c3sqp500di2rqmtxr5l2jn/static/5.186305,51.043187,13,0/400x400?access_token=pk.eyJ1IjoiaGVpbnYiLCJhIjoiNGEzYjEwYjY5MjM3YjQxNTZlZmY5MjE5YTViZWFiNjYifQ.dwA82fqv0CeVGxFMr30KIg","https://api.mapbox.com/styles/v1/heinv/cj1c3sqp500di2rqmtxr5l2jn/static/","51.043187","5.186305",",13,0/400x400?access_token=pk.eyJ1IjoiaGVpbnYiLCJhIjoiNGEzYjEwYjY5MjM3YjQxNTZlZmY5MjE5YTViZWFiNjYifQ.dwA82fqv0CeVGxFMr30KIg",null,null,null,null,null,20]
[21,"Lummen","Carpool parking Lummen","N717 / A2","Lummen","50.997621, 5.197778","2021-11-16","https://api.mapbox.com/styles/v1/heinv/cj1c3sqp500di2rqmtxr5l2jn/static/5.197778,50.997621,13,0/400x400?access_token=pk.eyJ1IjoiaGVpbnYiLCJhIjoiNGEzYjEwYjY5MjM3YjQxNTZlZmY5MjE5YTViZWFiNjYifQ.dwA82fqv0CeVGxFMr30KIg","https://api.mapbox.com/styles/v1/heinv/cj1c3sqp500di2rqmtxr5l2jn/static/","50.997621","5.197778",",13,0/400x400?access_token=pk.eyJ1IjoiaGVpbnYiLCJhIjoiNGEzYjEwYjY5MjM3YjQxNTZlZmY5MjE5YTViZWFiNjYifQ.dwA82fqv0CeVGxFMr30KIg",null,null,null,null,null,21]
[22,"Halen","Carpool parking Halen","N2 / A2","Halen","50.962073, 5.083806","2021-11-16","https://api.mapbox.com/styles/v1/heinv/cj1c3sqp500di2rqmtxr5l2jn/static/5.083806,50.962073,13,0/400x400?access_token=pk.eyJ1IjoiaGVpbnYiLCJhIjoiNGEzYjEwYjY5MjM3YjQxNTZlZmY5MjE5YTViZWFiNjYifQ.dwA82fqv0CeVGxFMr30KIg","https://api.mapbox.com/styles/v1/heinv/cj1c3sqp500di2rqmtxr5l2jn/static/","50.962073","5.083806",",13,0/400x400?access_token=pk.eyJ1IjoiaGVpbnYiLCJhIjoiNGEzYjEwYjY5MjM3YjQxNTZlZmY5MjE5YTViZWFiNjYifQ.dwA82fqv0CeVGxFMr30KIg",null,null,null,null,null,22]
[23,"Maasmechelen","Carpool parking Maasmechelen","N78 / E314","Maasmechelen","50.954058, 5.694835","2021-11-16","https://api.mapbox.com/styles/v1/heinv/cj1c3sqp500di2rqmtxr5l2jn/static/5.694835,50.954058,13,0/400x400?access_token=pk.eyJ1IjoiaGVpbnYiLCJhIjoiNGEzYjEwYjY5MjM3YjQxNTZlZmY5MjE5YTViZWFiNjYifQ.dwA82fqv0CeVGxFMr30KIg","https://api.mapbox.com/styles/v1/heinv/cj1c3sqp500di2rqmtxr5l2jn/static/","50.954058","5.694835",",13,0/400x400?access_token=pk.eyJ1IjoiaGVpbnYiLCJhIjoiNGEzYjEwYjY5MjM3YjQxNTZlZmY5MjE5YTViZWFiNjYifQ.dwA82fqv0CeVGxFMr30KIg",null,null,null,null,null,23]
[24,"Gentbrugge Arsenaal","P+R parking Gentbrugge Arsenaal","N9 / Jules de Saint-Genoisstraat","Gent","51.032277, 3.758713","2021-11-23","https://api.mapbox.com/styles/v1/heinv/cj1c3sqp500di2rqmtxr5l2jn/static/3.758713,51.032277,13,0/400x400?access_token=pk.eyJ1IjoiaGVpbnYiLCJhIjoiNGEzYjEwYjY5MjM3YjQxNTZlZmY5MjE5YTViZWFiNjYifQ.dwA82fqv0CeVGxFMr30KIg","https://api.mapbox.com/styles/v1/heinv/cj1c3sqp500di2rqmtxr5l2jn/static/","51.032277","3.758713",",13,0/400x400?access_token=pk.eyJ1IjoiaGVpbnYiLCJhIjoiNGEzYjEwYjY5MjM3YjQxNTZlZmY5MjE5YTViZWFiNjYifQ.dwA82fqv0CeVGxFMr30KIg",null,null,null,null,null,24]
[25,"Aalst-Zuid","Carpool parking Aalst-Zuid","N45 / N460","Aalst","50.913372, 4.031872","2021-11-23","https://api.mapbox.com/styles/v1/heinv/cj1c3sqp500di2rqmtxr5l2jn/static/4.031872,50.913372,13,0/400x400?access_token=pk.eyJ1IjoiaGVpbnYiLCJhIjoiNGEzYjEwYjY5MjM3YjQxNTZlZmY5MjE5YTViZWFiNjYifQ.dwA82fqv0CeVGxFMr30KIg","https://api.mapbox.com/styles/v1/heinv/cj1c3sqp500di2rqmtxr5l2jn/static/","50.913372","4.031872",",13,0/400x400?access_token=pk.eyJ1IjoiaGVpbnYiLCJhIjoiNGEzYjEwYjY5MjM3YjQxNTZlZmY5MjE5YTViZWFiNjYifQ.dwA82fqv0CeVGxFMr30KIg",null,null,null,null,null,25]
[26,"Waasmunster","P+R parking Waasmunster","N446 / A14","Waasmunster","51.127953, 4.079340","2021-11-09","https://api.mapbox.com/styles/v1/heinv/cj1c3sqp500di2rqmtxr5l2jn/static/4.079340,51.127953,13,0/400x400?access_token=pk.eyJ1IjoiaGVpbnYiLCJhIjoiNGEzYjEwYjY5MjM3YjQxNTZlZmY5MjE5YTViZWFiNjYifQ.dwA82fqv0CeVGxFMr30KIg","https://api.mapbox.com/styles/v1/heinv/cj1c3sqp500di2rqmtxr5l2jn/static/","51.127953","4.079340",",13,0/400x400?access_token=pk.eyJ1IjoiaGVpbnYiLCJhIjoiNGEzYjEwYjY5MjM3YjQxNTZlZmY5MjE5YTViZWFiNjYifQ.dwA82fqv0CeVGxFMr30KIg",null,null,null,null,null,26]
[27,"Melsele-Zuid","Carpool parking Melsele-Zuid","N450 / A11","Beveren","51.239507, 4.269469","2021-11-09","https://api.mapbox.com/styles/v1/heinv/cj1c3sqp500di2rqmtxr5l2jn/static/4.269469,51.239507,13,0/400x400?access_token=pk.eyJ1IjoiaGVpbnYiLCJhIjoiNGEzYjEwYjY5MjM3YjQxNTZlZmY5MjE5YTViZWFiNjYifQ.dwA82fqv0CeVGxFMr30KIg","https://api.mapbox.com/styles/v1/heinv/cj1c3sqp500di2rqmtxr5l2jn/static/","51.239507","4.269469",",13,0/400x400?access_token=pk.eyJ1IjoiaGVpbnYiLCJhIjoiNGEzYjEwYjY5MjM3YjQxNTZlZmY5MjE5YTViZWFiNjYifQ.dwA82fqv0CeVGxFMr30KIg",null,null,null,null,null,27]
[28,"Meerbeke","Carpool parking Meerbeke","N28 / N8","Ninove","50.828223, 4.034914","2021-11-23","https://api.mapbox.com/styles/v1/heinv/cj1c3sqp500di2rqmtxr5l2jn/static/4.034914,50.828223,13,0/400x400?access_token=pk.eyJ1IjoiaGVpbnYiLCJhIjoiNGEzYjEwYjY5MjM3YjQxNTZlZmY5MjE5YTViZWFiNjYifQ.dwA82fqv0CeVGxFMr30KIg","https://api.mapbox.com/styles/v1/heinv/cj1c3sqp500di2rqmtxr5l2jn/static/","50.828223","4.034914",",13,0/400x400?access_token=pk.eyJ1IjoiaGVpbnYiLCJhIjoiNGEzYjEwYjY5MjM3YjQxNTZlZmY5MjE5YTViZWFiNjYifQ.dwA82fqv0CeVGxFMr30KIg",null,null,null,null,null,28]
[29,"Ninove","Carpool parking Ninove","N255 / N8","Ninove","50.827345, 4.025918","2021-11-23","https://api.mapbox.com/styles/v1/heinv/cj1c3sqp500di2rqmtxr5l2jn/static/4.025918,50.827345,13,0/400x400?access_token=pk.eyJ1IjoiaGVpbnYiLCJhIjoiNGEzYjEwYjY5MjM3YjQxNTZlZmY5MjE5YTViZWFiNjYifQ.dwA82fqv0CeVGxFMr30KIg","https://api.mapbox.com/styles/v1/heinv/cj1c3sqp500di2rqmtxr5l2jn/static/","50.827345","4.025918",",13,0/400x400?access_token=pk.eyJ1IjoiaGVpbnYiLCJhIjoiNGEzYjEwYjY5MjM3YjQxNTZlZmY5MjE5YTViZWFiNjYifQ.dwA82fqv0CeVGxFMr30KIg",null,null,null,null,null,29]
[30,"Kruishoutem","Carpool parking Kruishoutem","N459 / A14","Kruishoutem","50.916012, 3.492023","2021-11-23","https://api.mapbox.com/styles/v1/heinv/cj1c3sqp500di2rqmtxr5l2jn/static/3.492023,50.916012,13,0/400x400?access_token=pk.eyJ1IjoiaGVpbnYiLCJhIjoiNGEzYjEwYjY5MjM3YjQxNTZlZmY5MjE5YTViZWFiNjYifQ.dwA82fqv0CeVGxFMr30KIg","https://api.mapbox.com/styles/v1/heinv/cj1c3sqp500di2rqmtxr5l2jn/static/","50.916012","3.492023",",13,0/400x400?access_token=pk.eyJ1IjoiaGVpbnYiLCJhIjoiNGEzYjEwYjY5MjM3YjQxNTZlZmY5MjE5YTViZWFiNjYifQ.dwA82fqv0CeVGxFMr30KIg",null,null,null,null,null,30]
[31,"Mersele-Noord","Carpool parking Mersele-Noord","N450 / A11","Beveren","51.243978, 4.271561",{"$error":"#N/A"},"https://api.mapbox.com/styles/v1/heinv/cj1c3sqp500di2rqmtxr5l2jn/static/4.271561,51.243978,13,0/400x400?access_token=pk.eyJ1IjoiaGVpbnYiLCJhIjoiNGEzYjEwYjY5MjM3YjQxNTZlZmY5MjE5YTViZWFiNjYifQ.dwA82fqv0CeVGxFMr30KIg","https://api.mapbox.com/styles/v1/heinv/cj1c3sqp500di2rqmtxr5l2jn/static/","51.243978","4.271561",",13,0/400x400?access_token=pk.eyJ1IjoiaGVpbnYiLCJhIjoiNGEzYjEwYjY5MjM3YjQxNTZlZmY5MjE5YTViZWFiNjYifQ.dwA82fqv0CeVGxFMr30KIg",null,null,null,null,null,31]
[32,"Vrasene-Noord","Carpool parking Vrasene-Noord","N451 / A11","Beveren","51.240943, 4.189741","2021-11-09","https://api.mapbox.com/styles/v1/heinv/cj1c3sqp500di2rqmtxr5l2jn/static/4.189741,51.240943,13,0/400x400?access_token=pk.eyJ1IjoiaGVpbnYiLCJhIjoiNGEzYjEwYjY5MjM3YjQxNTZlZmY5MjE5YTViZWFiNjYifQ.dwA82fqv0CeVGxFMr30KIg","https://api.mapbox.com/styles/v1/heinv/cj1c3sqp500di2rqmtxr5l2jn/static/","51.240943","4.189741",",13,0/400x400?access_token=pk.eyJ1IjoiaGVpbnYiLCJhIjoiNGEzYjEwYjY5MjM3YjQxNTZlZmY5MjE5YTViZWFiNjYifQ.dwA82fqv0CeVGxFMr30KIg",null,null,null,null,null,32]
[33,"Merelbeke","Carpool parking Merelbeke","B403 / R4","Merelbeke","51.003542, 3.763040","2021-11-23","https://api.mapbox.com/styles/v1/heinv/cj1c3sqp500di2rqmtxr5l2jn/static/3.763040,51.003542,13,0/400x400?access_token=pk.eyJ1IjoiaGVpbnYiLCJhIjoiNGEzYjEwYjY5MjM3YjQxNTZlZmY5MjE5YTViZWFiNjYifQ.dwA82fqv0CeVGxFMr30KIg","https://api.mapbox.com/styles/v1/heinv/cj1c3sqp500di2rqmtxr5l2jn/static/","51.003542","3.763040",",13,0/400x400?access_token=pk.eyJ1IjoiaGVpbnYiLCJhIjoiNGEzYjEwYjY5MjM3YjQxNTZlZmY5MjE5YTViZWFiNjYifQ.dwA82fqv0CeVGxFMr30KIg",null,null,null,null,null,33]
[34,"Vilvoorde","Carpool parking Vilvoorde","N211 / N21","Machelen","50.910540, 4.459740","2021-11-18","https://api.mapbox.com/styles/v1/heinv/cj1c3sqp500di2rqmtxr5l2jn/static/4.459740,50.910540,13,0/400x400?access_token=pk.eyJ1IjoiaGVpbnYiLCJhIjoiNGEzYjEwYjY5MjM3YjQxNTZlZmY5MjE5YTViZWFiNjYifQ.dwA82fqv0CeVGxFMr30KIg","https://api.mapbox.com/styles/v1/heinv/cj1c3sqp500di2rqmtxr5l2jn/static/","50.910540","4.459740",",13,0/400x400?access_token=pk.eyJ1IjoiaGVpbnYiLCJhIjoiNGEzYjEwYjY5MjM3YjQxNTZlZmY5MjE5YTViZWFiNjYifQ.dwA82fqv0CeVGxFMr30KIg",null,null,null,null,null,34]
[35,"Holsbeek","Carpool parking Holsbeek","N229 / A2","Leuven","50.933565, 4.743369","2021-11-16","https://api.mapbox.com/styles/v1/heinv/cj1c3sqp500di2rqmtxr5l2jn/static/4.743369,50.933565,13,0/400x400?access_token=pk.eyJ1IjoiaGVpbnYiLCJhIjoiNGEzYjEwYjY5MjM3YjQxNTZlZmY5MjE5YTViZWFiNjYifQ.dwA82fqv0CeVGxFMr30KIg","https://api.mapbox.com/styles/v1/heinv/cj1c3sqp500di2rqmtxr5l2jn/static/","50.933565","4.743369",",13,0/400x400?access_token=pk.eyJ1IjoiaGVpbnYiLCJhIjoiNGEzYjEwYjY5MjM3YjQxNTZlZmY5MjE5YTViZWFiNjYifQ.dwA82fqv0CeVGxFMr30KIg",null,null,null,null,null,35]
[36,"Halle-Essenbeek","P+R parking Halle-Essenbeek","N28 / N203a","Halle","50.721091, 4.250252","2021-11-23","https://api.mapbox.com/styles/v1/heinv/cj1c3sqp500di2rqmtxr5l2jn/static/4.250252,50.721091,13,0/400x400?access_token=pk.eyJ1IjoiaGVpbnYiLCJhIjoiNGEzYjEwYjY5MjM3YjQxNTZlZmY5MjE5YTViZWFiNjYifQ.dwA82fqv0CeVGxFMr30KIg","https://api.mapbox.com/styles/v1/heinv/cj1c3sqp500di2rqmtxr5l2jn/static/","50.721091","4.250252",",13,0/400x400?access_token=pk.eyJ1IjoiaGVpbnYiLCJhIjoiNGEzYjEwYjY5MjM3YjQxNTZlZmY5MjE5YTViZWFiNjYifQ.dwA82fqv0CeVGxFMr30KIg",null,null,null,null,null,36]
[37,"Halle-Sint Rochus","Carpool parking Halle-Sint Rochus","N203 / N203a","Halle","50.727008, 4.258883","2021-11-23","https://api.mapbox.com/styles/v1/heinv/cj1c3sqp500di2rqmtxr5l2jn/static/4.258883,50.727008,13,0/400x400?access_token=pk.eyJ1IjoiaGVpbnYiLCJhIjoiNGEzYjEwYjY5MjM3YjQxNTZlZmY5MjE5YTViZWFiNjYifQ.dwA82fqv0CeVGxFMr30KIg","https://api.mapbox.com/styles/v1/heinv/cj1c3sqp500di2rqmtxr5l2jn/static/","50.727008","4.258883",",13,0/400x400?access_token=pk.eyJ1IjoiaGVpbnYiLCJhIjoiNGEzYjEwYjY5MjM3YjQxNTZlZmY5MjE5YTViZWFiNjYifQ.dwA82fqv0CeVGxFMr30KIg",null,null,null,null,null,37]
[38,"Boutersem","Carpool parking Boutersem","N234 / A3","Boutersem","50.825404, 4.814390","2021-11-16","https://api.mapbox.com/styles/v1/heinv/cj1c3sqp500di2rqmtxr5l2jn/static/4.814390,50.825404,13,0/400x400?access_token=pk.eyJ1IjoiaGVpbnYiLCJhIjoiNGEzYjEwYjY5MjM3YjQxNTZlZmY5MjE5YTViZWFiNjYifQ.dwA82fqv0CeVGxFMr30KIg","https://api.mapbox.com/styles/v1/heinv/cj1c3sqp500di2rqmtxr5l2jn/static/","50.825404","4.814390",",13,0/400x400?access_token=pk.eyJ1IjoiaGVpbnYiLCJhIjoiNGEzYjEwYjY5MjM3YjQxNTZlZmY5MjE5YTViZWFiNjYifQ.dwA82fqv0CeVGxFMr30KIg",null,null,null,null,null,38]
[39,"Aarschot","Carpool parking Aarschot","A2 / N233","Aarschot","50.963819, 4.836608","2021-11-16","https://api.mapbox.com/styles/v1/heinv/cj1c3sqp500di2rqmtxr5l2jn/static/4.836608,50.963819,13,0/400x400?access_token=pk.eyJ1IjoiaGVpbnYiLCJhIjoiNGEzYjEwYjY5MjM3YjQxNTZlZmY5MjE5YTViZWFiNjYifQ.dwA82fqv0CeVGxFMr30KIg","https://api.mapbox.com/styles/v1/heinv/cj1c3sqp500di2rqmtxr5l2jn/static/","50.963819","4.836608",",13,0/400x400?access_token=pk.eyJ1IjoiaGVpbnYiLCJhIjoiNGEzYjEwYjY5MjM3YjQxNTZlZmY5MjE5YTViZWFiNjYifQ.dwA82fqv0CeVGxFMr30KIg",null,null,null,null,null,39]
[40,"Tielt-Winge","Carpool parking Tielt-Winge","N258 / A2","Tielt-Winge","50.959801, 4.930284","2021-11-16","https://api.mapbox.com/styles/v1/heinv/cj1c3sqp500di2rqmtxr5l2jn/static/4.930284,50.959801,13,0/400x400?access_token=pk.eyJ1IjoiaGVpbnYiLCJhIjoiNGEzYjEwYjY5MjM3YjQxNTZlZmY5MjE5YTViZWFiNjYifQ.dwA82fqv0CeVGxFMr30KIg","https://api.mapbox.com/styles/v1/heinv/cj1c3sqp500di2rqmtxr5l2jn/static/","50.959801","4.930284",",13,0/400x400?access_token=pk.eyJ1IjoiaGVpbnYiLCJhIjoiNGEzYjEwYjY5MjM3YjQxNTZlZmY5MjE5YTViZWFiNjYifQ.dwA82fqv0CeVGxFMr30KIg",null,null,null,null,null,40]
[41,"Walshoutem","Carpool parking Walshoutem","N80 / A3","Landen","50.713075, 5.081833","2021-11-16","https://api.mapbox.com/styles/v1/heinv/cj1c3sqp500di2rqmtxr5l2jn/static/5.081833,50.713075,13,0/400x400?access_token=pk.eyJ1IjoiaGVpbnYiLCJhIjoiNGEzYjEwYjY5MjM3YjQxNTZlZmY5MjE5YTViZWFiNjYifQ.dwA82fqv0CeVGxFMr30KIg","https://api.mapbox.com/styles/v1/heinv/cj1c3sqp500di2rqmtxr5l2jn/static/","50.713075","5.081833",",13,0/400x400?access_token=pk.eyJ1IjoiaGVpbnYiLCJhIjoiNGEzYjEwYjY5MjM3YjQxNTZlZmY5MjE5YTViZWFiNjYifQ.dwA82fqv0CeVGxFMr30KIg",null,null,null,null,null,41]
[42,"Zingem","Carpool parking Zingem","N435 / N60","Zingem","50.909427, 3.615886","2021-11-23","https://api.mapbox.com/styles/v1/heinv/cj1c3sqp500di2rqmtxr5l2jn/static/3.615886,50.909427,13,0/400x400?access_token=pk.eyJ1IjoiaGVpbnYiLCJhIjoiNGEzYjEwYjY5MjM3YjQxNTZlZmY5MjE5YTViZWFiNjYifQ.dwA82fqv0CeVGxFMr30KIg","https://api.mapbox.com/styles/v1/heinv/cj1c3sqp500di2rqmtxr5l2jn/static/","50.909427","3.615886",",13,0/400x400?access_token=pk.eyJ1IjoiaGVpbnYiLCJhIjoiNGEzYjEwYjY5MjM3YjQxNTZlZmY5MjE5YTViZWFiNjYifQ.dwA82fqv0CeVGxFMr30KIg",null,null,null,null,null,42]
[43,"Kemzeke-West","Carpool parking Kemzeke-West","N403 / N49","Stekene","51.229594, 4.060439","2021-11-09","https://api.mapbox.com/styles/v1/heinv/cj1c3sqp500di2rqmtxr5l2jn/static/4.060439,51.229594,13,0/400x400?access_token=pk.eyJ1IjoiaGVpbnYiLCJhIjoiNGEzYjEwYjY5MjM3YjQxNTZlZmY5MjE5YTViZWFiNjYifQ.dwA82fqv0CeVGxFMr30KIg","https://api.mapbox.com/styles/v1/heinv/cj1c3sqp500di2rqmtxr5l2jn/static/","51.229594","4.060439",",13,0/400x400?access_token=pk.eyJ1IjoiaGVpbnYiLCJhIjoiNGEzYjEwYjY5MjM3YjQxNTZlZmY5MjE5YTViZWFiNjYifQ.dwA82fqv0CeVGxFMr30KIg",null,null,null,null,null,43]
[44,"Kemzeke-Oost","Carpool parking Kemzeke-Oost","N403 / N49","Stekene","51.229783, 4.061087","2021-11-09","https://api.mapbox.com/styles/v1/heinv/cj1c3sqp500di2rqmtxr5l2jn/static/4.061087,51.229783,13,0/400x400?access_token=pk.eyJ1IjoiaGVpbnYiLCJhIjoiNGEzYjEwYjY5MjM3YjQxNTZlZmY5MjE5YTViZWFiNjYifQ.dwA82fqv0CeVGxFMr30KIg","https://api.mapbox.com/styles/v1/heinv/cj1c3sqp500di2rqmtxr5l2jn/static/","51.229783","4.061087",",13,0/400x400?access_token=pk.eyJ1IjoiaGVpbnYiLCJhIjoiNGEzYjEwYjY5MjM3YjQxNTZlZmY5MjE5YTViZWFiNjYifQ.dwA82fqv0CeVGxFMr30KIg",null,null,null,null,null,44]
[45,"Wommelgem-Noord","P+R parking Wommelgem-Noord","R11 / A13","Wommelgem","51.212489, 4.491956","2021-11-18","https://api.mapbox.com/styles/v1/heinv/cj1c3sqp500di2rqmtxr5l2jn/static/4.491956,51.212489,13,0/400x400?access_token=pk.eyJ1IjoiaGVpbnYiLCJhIjoiNGEzYjEwYjY5MjM3YjQxNTZlZmY5MjE5YTViZWFiNjYifQ.dwA82fqv0CeVGxFMr30KIg","https://api.mapbox.com/styles/v1/heinv/cj1c3sqp500di2rqmtxr5l2jn/static/","51.212489","4.491956",",13,0/400x400?access_token=pk.eyJ1IjoiaGVpbnYiLCJhIjoiNGEzYjEwYjY5MjM3YjQxNTZlZmY5MjE5YTViZWFiNjYifQ.dwA82fqv0CeVGxFMr30KIg",null,null,null,null,null,45]
[46,"Geel-Oost","Carpool parking Geel-Oost","N174 / A13","Laakdal","51.106646, 5.018691",{"$error":"#N/A"},"https://api.mapbox.com/styles/v1/heinv/cj1c3sqp500di2rqmtxr5l2jn/static/5.018691,51.106646,13,0/400x400?access_token=pk.eyJ1IjoiaGVpbnYiLCJhIjoiNGEzYjEwYjY5MjM3YjQxNTZlZmY5MjE5YTViZWFiNjYifQ.dwA82fqv0CeVGxFMr30KIg","https://api.mapbox.com/styles/v1/heinv/cj1c3sqp500di2rqmtxr5l2jn/static/","51.106646","5.018691",",13,0/400x400?access_token=pk.eyJ1IjoiaGVpbnYiLCJhIjoiNGEzYjEwYjY5MjM3YjQxNTZlZmY5MjE5YTViZWFiNjYifQ.dwA82fqv0CeVGxFMr30KIg",null,null,null,null,null,46]
[47,"Lille","Carpool parking Lille","N153 / A21","Lille","51.254780, 4.807767","2021-11-18","https://api.mapbox.com/styles/v1/heinv/cj1c3sqp500di2rqmtxr5l2jn/static/4.807767,51.254780,13,0/400x400?access_token=pk.eyJ1IjoiaGVpbnYiLCJhIjoiNGEzYjEwYjY5MjM3YjQxNTZlZmY5MjE5YTViZWFiNjYifQ.dwA82fqv0CeVGxFMr30KIg","https://api.mapbox.com/styles/v1/heinv/cj1c3sqp500di2rqmtxr5l2jn/static/","51.254780","4.807767",",13,0/400x400?access_token=pk.eyJ1IjoiaGVpbnYiLCJhIjoiNGEzYjEwYjY5MjM3YjQxNTZlZmY5MjE5YTViZWFiNjYifQ.dwA82fqv0CeVGxFMr30KIg",null,null,null,null,null,47]
[48,"Oelegem-West","Carpool parking Oelegem-West","A21 / Zandhovensesteenweg","Ranst","51.212044, 4.623777","2021-11-18","https://api.mapbox.com/styles/v1/heinv/cj1c3sqp500di2rqmtxr5l2jn/static/4.623777,51.212044,13,0/400x400?access_token=pk.eyJ1IjoiaGVpbnYiLCJhIjoiNGEzYjEwYjY5MjM3YjQxNTZlZmY5MjE5YTViZWFiNjYifQ.dwA82fqv0CeVGxFMr30KIg","https://api.mapbox.com/styles/v1/heinv/cj1c3sqp500di2rqmtxr5l2jn/static/","51.212044","4.623777",",13,0/400x400?access_token=pk.eyJ1IjoiaGVpbnYiLCJhIjoiNGEzYjEwYjY5MjM3YjQxNTZlZmY5MjE5YTViZWFiNjYifQ.dwA82fqv0CeVGxFMr30KIg",null,null,null,null,null,48]
[49,"Oelegem-Oost","Carpool parking Oelegem-Oost","A21 / Zandhovensesteenweg","Ranst","51.211693, 4.625380","2021-11-18","https://api.mapbox.com/styles/v1/heinv/cj1c3sqp500di2rqmtxr5l2jn/static/4.625380,51.211693,13,0/400x400?access_token=pk.eyJ1IjoiaGVpbnYiLCJhIjoiNGEzYjEwYjY5MjM3YjQxNTZlZmY5MjE5YTViZWFiNjYifQ.dwA82fqv0CeVGxFMr30KIg","https://api.mapbox.com/styles/v1/heinv/cj1c3sqp500di2rqmtxr5l2jn/static/","51.211693","4.625380",",13,0/400x400?access_token=pk.eyJ1IjoiaGVpbnYiLCJhIjoiNGEzYjEwYjY5MjM3YjQxNTZlZmY5MjE5YTViZWFiNjYifQ.dwA82fqv0CeVGxFMr30KIg",null,null,null,null,null,49]
[50,"Sint Job in 't Goor","P+R parking Sint Job in 't Goor","N117 / A1","Brasschaat","51.309564, 4.555137","2021-11-09","https://api.mapbox.com/styles/v1/heinv/cj1c3sqp500di2rqmtxr5l2jn/static/4.555137,51.309564,13,0/400x400?access_token=pk.eyJ1IjoiaGVpbnYiLCJhIjoiNGEzYjEwYjY5MjM3YjQxNTZlZmY5MjE5YTViZWFiNjYifQ.dwA82fqv0CeVGxFMr30KIg","https://api.mapbox.com/styles/v1/heinv/cj1c3sqp500di2rqmtxr5l2jn/static/","51.309564","4.555137",",13,0/400x400?access_token=pk.eyJ1IjoiaGVpbnYiLCJhIjoiNGEzYjEwYjY5MjM3YjQxNTZlZmY5MjE5YTViZWFiNjYifQ.dwA82fqv0CeVGxFMr30KIg",null,null,null,null,null,50]
[51,"Menen","Carpool parking Menen","A19 / N32","Menen","50.817106, 3.125718","2021-11-23","https://api.mapbox.com/styles/v1/heinv/cj1c3sqp500di2rqmtxr5l2jn/static/3.125718,50.817106,13,0/400x400?access_token=pk.eyJ1IjoiaGVpbnYiLCJhIjoiNGEzYjEwYjY5MjM3YjQxNTZlZmY5MjE5YTViZWFiNjYifQ.dwA82fqv0CeVGxFMr30KIg","https://api.mapbox.com/styles/v1/heinv/cj1c3sqp500di2rqmtxr5l2jn/static/","50.817106","3.125718",",13,0/400x400?access_token=pk.eyJ1IjoiaGVpbnYiLCJhIjoiNGEzYjEwYjY5MjM3YjQxNTZlZmY5MjE5YTViZWFiNjYifQ.dwA82fqv0CeVGxFMr30KIg",null,null,null,null,null,51]
[52,"Deerlijk","Carpool parking Deerlijk","N36 / Vichtesteenweg","Deerlijk","50.850190, 3.368235","2021-11-23","https://api.mapbox.com/styles/v1/heinv/cj1c3sqp500di2rqmtxr5l2jn/static/3.368235,50.850190,13,0/400x400?access_token=pk.eyJ1IjoiaGVpbnYiLCJhIjoiNGEzYjEwYjY5MjM3YjQxNTZlZmY5MjE5YTViZWFiNjYifQ.dwA82fqv0CeVGxFMr30KIg","https://api.mapbox.com/styles/v1/heinv/cj1c3sqp500di2rqmtxr5l2jn/static/","50.850190","3.368235",",13,0/400x400?access_token=pk.eyJ1IjoiaGVpbnYiLCJhIjoiNGEzYjEwYjY5MjM3YjQxNTZlZmY5MjE5YTViZWFiNjYifQ.dwA82fqv0CeVGxFMr30KIg",null,null,null,null,null,52]
[53,"Zoersel","Carpool parking Zoersel","N14 / A21","Zoersel","51.245282, 4.703352","2021-11-18","https://api.mapbox.com/styles/v1/heinv/cj1c3sqp500di2rqmtxr5l2jn/static/4.703352,51.245282,13,0/400x400?access_token=pk.eyJ1IjoiaGVpbnYiLCJhIjoiNGEzYjEwYjY5MjM3YjQxNTZlZmY5MjE5YTViZWFiNjYifQ.dwA82fqv0CeVGxFMr30KIg","https://api.mapbox.com/styles/v1/heinv/cj1c3sqp500di2rqmtxr5l2jn/static/","51.245282","4.703352",",13,0/400x400?access_token=pk.eyJ1IjoiaGVpbnYiLCJhIjoiNGEzYjEwYjY5MjM3YjQxNTZlZmY5MjE5YTViZWFiNjYifQ.dwA82fqv0CeVGxFMr30KIg",null,null,null,null,null,53]
[54,"E17 Deinze","Carpool parking E17 Deinze","N35 / N17","Nazareth","50.952738, 3.569722","2021-11-23","https://api.mapbox.com/styles/v1/heinv/cj1c3sqp500di2rqmtxr5l2jn/static/3.569722,50.952738,13,0/400x400?access_token=pk.eyJ1IjoiaGVpbnYiLCJhIjoiNGEzYjEwYjY5MjM3YjQxNTZlZmY5MjE5YTViZWFiNjYifQ.dwA82fqv0CeVGxFMr30KIg","https://api.mapbox.com/styles/v1/heinv/cj1c3sqp500di2rqmtxr5l2jn/static/","50.952738","3.569722",",13,0/400x400?access_token=pk.eyJ1IjoiaGVpbnYiLCJhIjoiNGEzYjEwYjY5MjM3YjQxNTZlZmY5MjE5YTViZWFiNjYifQ.dwA82fqv0CeVGxFMr30KIg",null,null,null,null,null,54]
[55,"Erpe-Mere","Carpool parking Erpe-Mere","N46 / A10","Erpe-Mere","50.927985, 3.958209","2021-11-23","https://api.mapbox.com/styles/v1/heinv/cj1c3sqp500di2rqmtxr5l2jn/static/3.958209,50.927985,13,0/400x400?access_token=pk.eyJ1IjoiaGVpbnYiLCJhIjoiNGEzYjEwYjY5MjM3YjQxNTZlZmY5MjE5YTViZWFiNjYifQ.dwA82fqv0CeVGxFMr30KIg","https://api.mapbox.com/styles/v1/heinv/cj1c3sqp500di2rqmtxr5l2jn/static/","50.927985","3.958209",",13,0/400x400?access_token=pk.eyJ1IjoiaGVpbnYiLCJhIjoiNGEzYjEwYjY5MjM3YjQxNTZlZmY5MjE5YTViZWFiNjYifQ.dwA82fqv0CeVGxFMr30KIg",null,null,null,null,null,55]
[56,"Geel-West","Carpool parking Geel-West","N19 / Bell-Telephonelaan","Westerlo","51.133020, 4.940494","2021-11-18","https://api.mapbox.com/styles/v1/heinv/cj1c3sqp500di2rqmtxr5l2jn/static/4.940494,51.133020,13,0/400x400?access_token=pk.eyJ1IjoiaGVpbnYiLCJhIjoiNGEzYjEwYjY5MjM3YjQxNTZlZmY5MjE5YTViZWFiNjYifQ.dwA82fqv0CeVGxFMr30KIg","https://api.mapbox.com/styles/v1/heinv/cj1c3sqp500di2rqmtxr5l2jn/static/","51.133020","4.940494",",13,0/400x400?access_token=pk.eyJ1IjoiaGVpbnYiLCJhIjoiNGEzYjEwYjY5MjM3YjQxNTZlZmY5MjE5YTViZWFiNjYifQ.dwA82fqv0CeVGxFMr30KIg",null,null,null,null,null,56]
[57,"Veurne","Carpool parking Veurne","N39 / N8","Veurne","51.070372, 2.656499","2021-11-09","https://api.mapbox.com/styles/v1/heinv/cj1c3sqp500di2rqmtxr5l2jn/static/2.656499,51.070372,13,0/400x400?access_token=pk.eyJ1IjoiaGVpbnYiLCJhIjoiNGEzYjEwYjY5MjM3YjQxNTZlZmY5MjE5YTViZWFiNjYifQ.dwA82fqv0CeVGxFMr30KIg","https://api.mapbox.com/styles/v1/heinv/cj1c3sqp500di2rqmtxr5l2jn/static/","51.070372","2.656499",",13,0/400x400?access_token=pk.eyJ1IjoiaGVpbnYiLCJhIjoiNGEzYjEwYjY5MjM3YjQxNTZlZmY5MjE5YTViZWFiNjYifQ.dwA82fqv0CeVGxFMr30KIg",null,null,null,null,null,57]
[58,"Oudenburg","Carpool parking Oudenburg","N358 / A10","Oudenburg","51.200906, 3.007635","2021-11-09","https://api.mapbox.com/styles/v1/heinv/cj1c3sqp500di2rqmtxr5l2jn/static/3.007635,51.200906,13,0/400x400?access_token=pk.eyJ1IjoiaGVpbnYiLCJhIjoiNGEzYjEwYjY5MjM3YjQxNTZlZmY5MjE5YTViZWFiNjYifQ.dwA82fqv0CeVGxFMr30KIg","https://api.mapbox.com/styles/v1/heinv/cj1c3sqp500di2rqmtxr5l2jn/static/","51.200906","3.007635",",13,0/400x400?access_token=pk.eyJ1IjoiaGVpbnYiLCJhIjoiNGEzYjEwYjY5MjM3YjQxNTZlZmY5MjE5YTViZWFiNjYifQ.dwA82fqv0CeVGxFMr30KIg",null,null,null,null,null,58]
[59,"Middelkerke","Carpool parking Middelkerke","N369 / A18","Middelkerke","51.139750, 2.862593","2021-11-09","https://api.mapbox.com/styles/v1/heinv/cj1c3sqp500di2rqmtxr5l2jn/static/2.862593,51.139750,13,0/400x400?access_token=pk.eyJ1IjoiaGVpbnYiLCJhIjoiNGEzYjEwYjY5MjM3YjQxNTZlZmY5MjE5YTViZWFiNjYifQ.dwA82fqv0CeVGxFMr30KIg","https://api.mapbox.com/styles/v1/heinv/cj1c3sqp500di2rqmtxr5l2jn/static/","51.139750","2.862593",",13,0/400x400?access_token=pk.eyJ1IjoiaGVpbnYiLCJhIjoiNGEzYjEwYjY5MjM3YjQxNTZlZmY5MjE5YTViZWFiNjYifQ.dwA82fqv0CeVGxFMr30KIg",null,null,null,null,null,59]
[60,"Loenhout","P+R parking Loenhout","N144 / Hollandseweg","Wuustwezel","51.397419, 4.689008","2021-11-09","https://api.mapbox.com/styles/v1/heinv/cj1c3sqp500di2rqmtxr5l2jn/static/4.689008,51.397419,13,0/400x400?access_token=pk.eyJ1IjoiaGVpbnYiLCJhIjoiNGEzYjEwYjY5MjM3YjQxNTZlZmY5MjE5YTViZWFiNjYifQ.dwA82fqv0CeVGxFMr30KIg","https://api.mapbox.com/styles/v1/heinv/cj1c3sqp500di2rqmtxr5l2jn/static/","51.397419","4.689008",",13,0/400x400?access_token=pk.eyJ1IjoiaGVpbnYiLCJhIjoiNGEzYjEwYjY5MjM3YjQxNTZlZmY5MjE5YTViZWFiNjYifQ.dwA82fqv0CeVGxFMr30KIg",null,null,null,null,null,60]
[61,"Meise","P+R parking Meise","N227 / A12","Meise","50.934686, 4.330993","2021-11-18","https://api.mapbox.com/styles/v1/heinv/cj1c3sqp500di2rqmtxr5l2jn/static/4.330993,50.934686,13,0/400x400?access_token=pk.eyJ1IjoiaGVpbnYiLCJhIjoiNGEzYjEwYjY5MjM3YjQxNTZlZmY5MjE5YTViZWFiNjYifQ.dwA82fqv0CeVGxFMr30KIg","https://api.mapbox.com/styles/v1/heinv/cj1c3sqp500di2rqmtxr5l2jn/static/","50.934686","4.330993",",13,0/400x400?access_token=pk.eyJ1IjoiaGVpbnYiLCJhIjoiNGEzYjEwYjY5MjM3YjQxNTZlZmY5MjE5YTViZWFiNjYifQ.dwA82fqv0CeVGxFMr30KIg",null,null,null,null,null,61]
[62,"Nieuwpoort","Carpool parking Nieuwpoort","N355 / A18","Nieuwpoort","51.109593, 2.757978","2021-11-09","https://api.mapbox.com/styles/v1/heinv/cj1c3sqp500di2rqmtxr5l2jn/static/2.757978,51.109593,13,0/400x400?access_token=pk.eyJ1IjoiaGVpbnYiLCJhIjoiNGEzYjEwYjY5MjM3YjQxNTZlZmY5MjE5YTViZWFiNjYifQ.dwA82fqv0CeVGxFMr30KIg","https://api.mapbox.com/styles/v1/heinv/cj1c3sqp500di2rqmtxr5l2jn/static/","51.109593","2.757978",",13,0/400x400?access_token=pk.eyJ1IjoiaGVpbnYiLCJhIjoiNGEzYjEwYjY5MjM3YjQxNTZlZmY5MjE5YTViZWFiNjYifQ.dwA82fqv0CeVGxFMr30KIg",null,null,null,null,null,62]
[63,"Lichtervelde","Carpool parking Lichtervelde","N35 / A17","Lichtervelde","51.011285, 3.167382","2021-11-23","https://api.mapbox.com/styles/v1/heinv/cj1c3sqp500di2rqmtxr5l2jn/static/3.167382,51.011285,13,0/400x400?access_token=pk.eyJ1IjoiaGVpbnYiLCJhIjoiNGEzYjEwYjY5MjM3YjQxNTZlZmY5MjE5YTViZWFiNjYifQ.dwA82fqv0CeVGxFMr30KIg","https://api.mapbox.com/styles/v1/heinv/cj1c3sqp500di2rqmtxr5l2jn/static/","51.011285","3.167382",",13,0/400x400?access_token=pk.eyJ1IjoiaGVpbnYiLCJhIjoiNGEzYjEwYjY5MjM3YjQxNTZlZmY5MjE5YTViZWFiNjYifQ.dwA82fqv0CeVGxFMr30KIg",null,null,null,null,null,63]
[64,"Kortrijk-Oost","Carpool parking Kortrijk-Oost","N8 / A14","Kortrijk","50.817455, 3.299312","2021-11-23","https://api.mapbox.com/styles/v1/heinv/cj1c3sqp500di2rqmtxr5l2jn/static/3.299312,50.817455,13,0/400x400?access_token=pk.eyJ1IjoiaGVpbnYiLCJhIjoiNGEzYjEwYjY5MjM3YjQxNTZlZmY5MjE5YTViZWFiNjYifQ.dwA82fqv0CeVGxFMr30KIg","https://api.mapbox.com/styles/v1/heinv/cj1c3sqp500di2rqmtxr5l2jn/static/","50.817455","3.299312",",13,0/400x400?access_token=pk.eyJ1IjoiaGVpbnYiLCJhIjoiNGEzYjEwYjY5MjM3YjQxNTZlZmY5MjE5YTViZWFiNjYifQ.dwA82fqv0CeVGxFMr30KIg",null,null,null,null,null,64]
[65,"Loppem","P+R parking Loppem","N397 / E40","Zedelgem","51.162436, 3.192146","2021-11-09","https://api.mapbox.com/styles/v1/heinv/cj1c3sqp500di2rqmtxr5l2jn/static/3.192146,51.162436,13,0/400x400?access_token=pk.eyJ1IjoiaGVpbnYiLCJhIjoiNGEzYjEwYjY5MjM3YjQxNTZlZmY5MjE5YTViZWFiNjYifQ.dwA82fqv0CeVGxFMr30KIg","https://api.mapbox.com/styles/v1/heinv/cj1c3sqp500di2rqmtxr5l2jn/static/","51.162436","3.192146",",13,0/400x400?access_token=pk.eyJ1IjoiaGVpbnYiLCJhIjoiNGEzYjEwYjY5MjM3YjQxNTZlZmY5MjE5YTViZWFiNjYifQ.dwA82fqv0CeVGxFMr30KIg",null,null,null,null,null,65]
[66,"Jabbeke-Oost","Carpool parking Jabbeke-Oost","N376 / Vlamingveld","Jabbeke","51.180310, 3.113845","2021-11-09","https://api.mapbox.com/styles/v1/heinv/cj1c3sqp500di2rqmtxr5l2jn/static/3.113845,51.180310,13,0/400x400?access_token=pk.eyJ1IjoiaGVpbnYiLCJhIjoiNGEzYjEwYjY5MjM3YjQxNTZlZmY5MjE5YTViZWFiNjYifQ.dwA82fqv0CeVGxFMr30KIg","https://api.mapbox.com/styles/v1/heinv/cj1c3sqp500di2rqmtxr5l2jn/static/","51.180310","3.113845",",13,0/400x400?access_token=pk.eyJ1IjoiaGVpbnYiLCJhIjoiNGEzYjEwYjY5MjM3YjQxNTZlZmY5MjE5YTViZWFiNjYifQ.dwA82fqv0CeVGxFMr30KIg",null,null,null,null,null,66]
[67,"Waregem","Carpool parking Waregem","N357 / Franklin Rooseveltlaan","Waregem","50.873938, 3.441505","2021-11-23","https://api.mapbox.com/styles/v1/heinv/cj1c3sqp500di2rqmtxr5l2jn/static/3.441505,50.873938,13,0/400x400?access_token=pk.eyJ1IjoiaGVpbnYiLCJhIjoiNGEzYjEwYjY5MjM3YjQxNTZlZmY5MjE5YTViZWFiNjYifQ.dwA82fqv0CeVGxFMr30KIg","https://api.mapbox.com/styles/v1/heinv/cj1c3sqp500di2rqmtxr5l2jn/static/","50.873938","3.441505",",13,0/400x400?access_token=pk.eyJ1IjoiaGVpbnYiLCJhIjoiNGEzYjEwYjY5MjM3YjQxNTZlZmY5MjE5YTViZWFiNjYifQ.dwA82fqv0CeVGxFMr30KIg",null,null,null,null,null,67]
[68,"Zandvoorde","Carpool parking Zandvoorde","A10 / Kasteelstraat","Oostende","51.204204, 2.976173","2021-11-09","https://api.mapbox.com/styles/v1/heinv/cj1c3sqp500di2rqmtxr5l2jn/static/2.976173,51.204204,13,0/400x400?access_token=pk.eyJ1IjoiaGVpbnYiLCJhIjoiNGEzYjEwYjY5MjM3YjQxNTZlZmY5MjE5YTViZWFiNjYifQ.dwA82fqv0CeVGxFMr30KIg","https://api.mapbox.com/styles/v1/heinv/cj1c3sqp500di2rqmtxr5l2jn/static/","51.204204","2.976173",",13,0/400x400?access_token=pk.eyJ1IjoiaGVpbnYiLCJhIjoiNGEzYjEwYjY5MjM3YjQxNTZlZmY5MjE5YTViZWFiNjYifQ.dwA82fqv0CeVGxFMr30KIg",null,null,null,null,null,68]
[69,"Beernem","Carpool parking Beernem","N370 / A10","Beernem","51.120332, 3.324059","2021-11-09","https://api.mapbox.com/styles/v1/heinv/cj1c3sqp500di2rqmtxr5l2jn/static/3.324059,51.120332,13,0/400x400?access_token=pk.eyJ1IjoiaGVpbnYiLCJhIjoiNGEzYjEwYjY5MjM3YjQxNTZlZmY5MjE5YTViZWFiNjYifQ.dwA82fqv0CeVGxFMr30KIg","https://api.mapbox.com/styles/v1/heinv/cj1c3sqp500di2rqmtxr5l2jn/static/","51.120332","3.324059",",13,0/400x400?access_token=pk.eyJ1IjoiaGVpbnYiLCJhIjoiNGEzYjEwYjY5MjM3YjQxNTZlZmY5MjE5YTViZWFiNjYifQ.dwA82fqv0CeVGxFMr30KIg",null,null,null,null,null,69]
[70,"The Loop-Expo","P+R parking The Loop/Expo","Derbystraat / Hélène Dutrieulaan","Gent","51.024607, 3.695634","2021-11-23","https://api.mapbox.com/styles/v1/heinv/cj1c3sqp500di2rqmtxr5l2jn/static/3.695634,51.024607,13,0/400x400?access_token=pk.eyJ1IjoiaGVpbnYiLCJhIjoiNGEzYjEwYjY5MjM3YjQxNTZlZmY5MjE5YTViZWFiNjYifQ.dwA82fqv0CeVGxFMr30KIg","https://api.mapbox.com/styles/v1/heinv/cj1c3sqp500di2rqmtxr5l2jn/static/","51.024607","3.695634",",13,0/400x400?access_token=pk.eyJ1IjoiaGVpbnYiLCJhIjoiNGEzYjEwYjY5MjM3YjQxNTZlZmY5MjE5YTViZWFiNjYifQ.dwA82fqv0CeVGxFMr30KIg",null,null,null,null,null,70]
[71,"Oostkamp","Carpool parking Oostkamp","N50g / A10","Oostkamp","51.143977, 3.245762",{"$error":"#N/A"},"https://api.mapbox.com/styles/v1/heinv/cj1c3sqp500di2rqmtxr5l2jn/static/3.245762,51.143977,13,0/400x400?access_token=pk.eyJ1IjoiaGVpbnYiLCJhIjoiNGEzYjEwYjY5MjM3YjQxNTZlZmY5MjE5YTViZWFiNjYifQ.dwA82fqv0CeVGxFMr30KIg","https://api.mapbox.com/styles/v1/heinv/cj1c3sqp500di2rqmtxr5l2jn/static/","51.143977","3.245762",",13,0/400x400?access_token=pk.eyJ1IjoiaGVpbnYiLCJhIjoiNGEzYjEwYjY5MjM3YjQxNTZlZmY5MjE5YTViZWFiNjYifQ.dwA82fqv0CeVGxFMr30KIg",null,null,null,null,null,71]
[72,"Veurne","Carpool parking Veurne","N8 / A18","Veurne","51.057349, 2.667068","2021-11-09","https://api.mapbox.com/styles/v1/heinv/cj1c3sqp500di2rqmtxr5l2jn/static/2.667068,51.057349,13,0/400x400?access_token=pk.eyJ1IjoiaGVpbnYiLCJhIjoiNGEzYjEwYjY5MjM3YjQxNTZlZmY5MjE5YTViZWFiNjYifQ.dwA82fqv0CeVGxFMr30KIg","https://api.mapbox.com/styles/v1/heinv/cj1c3sqp500di2rqmtxr5l2jn/static/","51.057349","2.667068",",13,0/400x400?access_token=pk.eyJ1IjoiaGVpbnYiLCJhIjoiNGEzYjEwYjY5MjM3YjQxNTZlZmY5MjE5YTViZWFiNjYifQ.dwA82fqv0CeVGxFMr30KIg",null,null,null,null,null,72]
[73,"Jabbeke-West","Carpool parking Jabbeke-West","N377 / A10","Jabbeke","51.187549, 3.093136","2021-11-09","https://api.mapbox.com/styles/v1/heinv/cj1c3sqp500di2rqmtxr5l2jn/static/3.093136,51.187549,13,0/400x400?access_token=pk.eyJ1IjoiaGVpbnYiLCJhIjoiNGEzYjEwYjY5MjM3YjQxNTZlZmY5MjE5YTViZWFiNjYifQ.dwA82fqv0CeVGxFMr30KIg","https://api.mapbox.com/styles/v1/heinv/cj1c3sqp500di2rqmtxr5l2jn/static/","51.187549","3.093136",",13,0/400x400?access_token=pk.eyJ1IjoiaGVpbnYiLCJhIjoiNGEzYjEwYjY5MjM3YjQxNTZlZmY5MjE5YTViZWFiNjYifQ.dwA82fqv0CeVGxFMr30KIg",null,null,null,null,null,73]
[74,"Melsele","P+R parking Melsele","N70 / N419","Beveren","51.218385, 4.305929","2021-11-09","https://api.mapbox.com/styles/v1/heinv/cj1c3sqp500di2rqmtxr5l2jn/static/4.305929,51.218385,13,0/400x400?access_token=pk.eyJ1IjoiaGVpbnYiLCJhIjoiNGEzYjEwYjY5MjM3YjQxNTZlZmY5MjE5YTViZWFiNjYifQ.dwA82fqv0CeVGxFMr30KIg","https://api.mapbox.com/styles/v1/heinv/cj1c3sqp500di2rqmtxr5l2jn/static/","51.218385","4.305929",",13,0/400x400?access_token=pk.eyJ1IjoiaGVpbnYiLCJhIjoiNGEzYjEwYjY5MjM3YjQxNTZlZmY5MjE5YTViZWFiNjYifQ.dwA82fqv0CeVGxFMr30KIg",null,null,null,null,null,74]
[75,"Frederik van Eeden","Carpool parking Frederik van Eeden","Frederik van Eedenplein / Lode Zielenslaan","Antwerpen","51.221309, 4.386971",{"$error":"#N/A"},"https://api.mapbox.com/styles/v1/heinv/cj1c3sqp500di2rqmtxr5l2jn/static/4.386971,51.221309,13,0/400x400?access_token=pk.eyJ1IjoiaGVpbnYiLCJhIjoiNGEzYjEwYjY5MjM3YjQxNTZlZmY5MjE5YTViZWFiNjYifQ.dwA82fqv0CeVGxFMr30KIg","https://api.mapbox.com/styles/v1/heinv/cj1c3sqp500di2rqmtxr5l2jn/static/","51.221309","4.386971",",13,0/400x400?access_token=pk.eyJ1IjoiaGVpbnYiLCJhIjoiNGEzYjEwYjY5MjM3YjQxNTZlZmY5MjE5YTViZWFiNjYifQ.dwA82fqv0CeVGxFMr30KIg",null,null,null,null,null,75]
[76,"Wuustwezel","Carpool parking Wuustwezel","N1 / N144","Wuustwezel","51.408496, 4.612086","2021-11-18","https://api.mapbox.com/styles/v1/heinv/cj1c3sqp500di2rqmtxr5l2jn/static/4.612086,51.408496,13,0/400x400?access_token=pk.eyJ1IjoiaGVpbnYiLCJhIjoiNGEzYjEwYjY5MjM3YjQxNTZlZmY5MjE5YTViZWFiNjYifQ.dwA82fqv0CeVGxFMr30KIg","https://api.mapbox.com/styles/v1/heinv/cj1c3sqp500di2rqmtxr5l2jn/static/","51.408496","4.612086",",13,0/400x400?access_token=pk.eyJ1IjoiaGVpbnYiLCJhIjoiNGEzYjEwYjY5MjM3YjQxNTZlZmY5MjE5YTViZWFiNjYifQ.dwA82fqv0CeVGxFMr30KIg",null,null,null,null,null,76]
[77,"Keizershoek","Carpool parking/P+R parking Keizershoek","N1 / Horstebaan","Antwerpen","51.258243, 4.461816","2021-11-09","https://api.mapbox.com/styles/v1/heinv/cj1c3sqp500di2rqmtxr5l2jn/static/4.461816,51.258243,13,0/400x400?access_token=pk.eyJ1IjoiaGVpbnYiLCJhIjoiNGEzYjEwYjY5MjM3YjQxNTZlZmY5MjE5YTViZWFiNjYifQ.dwA82fqv0CeVGxFMr30KIg","https://api.mapbox.com/styles/v1/heinv/cj1c3sqp500di2rqmtxr5l2jn/static/","51.258243","4.461816",",13,0/400x400?access_token=pk.eyJ1IjoiaGVpbnYiLCJhIjoiNGEzYjEwYjY5MjM3YjQxNTZlZmY5MjE5YTViZWFiNjYifQ.dwA82fqv0CeVGxFMr30KIg",null,null,null,null,null,77]
[78,"Blancefloerlaan","Carpool parking Blancefloerlaan","R1 / N70","Antwerpen","51.219428, 4.347431","2021-11-09","https://api.mapbox.com/styles/v1/heinv/cj1c3sqp500di2rqmtxr5l2jn/static/4.347431,51.219428,13,0/400x400?access_token=pk.eyJ1IjoiaGVpbnYiLCJhIjoiNGEzYjEwYjY5MjM3YjQxNTZlZmY5MjE5YTViZWFiNjYifQ.dwA82fqv0CeVGxFMr30KIg","https://api.mapbox.com/styles/v1/heinv/cj1c3sqp500di2rqmtxr5l2jn/static/","51.219428","4.347431",",13,0/400x400?access_token=pk.eyJ1IjoiaGVpbnYiLCJhIjoiNGEzYjEwYjY5MjM3YjQxNTZlZmY5MjE5YTViZWFiNjYifQ.dwA82fqv0CeVGxFMr30KIg",null,null,null,null,null,78]
[79,"Kiewit","Carpool parking Kiewit","N74 / Schrijnbroekstraat","Hasselt","50.954067, 5.349303",{"$error":"#N/A"},"https://api.mapbox.com/styles/v1/heinv/cj1c3sqp500di2rqmtxr5l2jn/static/5.349303,50.954067,13,0/400x400?access_token=pk.eyJ1IjoiaGVpbnYiLCJhIjoiNGEzYjEwYjY5MjM3YjQxNTZlZmY5MjE5YTViZWFiNjYifQ.dwA82fqv0CeVGxFMr30KIg","https://api.mapbox.com/styles/v1/heinv/cj1c3sqp500di2rqmtxr5l2jn/static/","50.954067","5.349303",",13,0/400x400?access_token=pk.eyJ1IjoiaGVpbnYiLCJhIjoiNGEzYjEwYjY5MjM3YjQxNTZlZmY5MjE5YTViZWFiNjYifQ.dwA82fqv0CeVGxFMr30KIg",null,null,null,null,null,79]
[80,"Gentbrugge","P+R parking Gentbrugge","N9 / A14","Gent","51.034971, 3.755526",{"$error":"#N/A"},"https://api.mapbox.com/styles/v1/heinv/cj1c3sqp500di2rqmtxr5l2jn/static/3.755526,51.034971,13,0/400x400?access_token=pk.eyJ1IjoiaGVpbnYiLCJhIjoiNGEzYjEwYjY5MjM3YjQxNTZlZmY5MjE5YTViZWFiNjYifQ.dwA82fqv0CeVGxFMr30KIg","https://api.mapbox.com/styles/v1/heinv/cj1c3sqp500di2rqmtxr5l2jn/static/","51.034971","3.755526",",13,0/400x400?access_token=pk.eyJ1IjoiaGVpbnYiLCJhIjoiNGEzYjEwYjY5MjM3YjQxNTZlZmY5MjE5YTViZWFiNjYifQ.dwA82fqv0CeVGxFMr30KIg",null,null,null,null,null,80]
[81,"Rotselaar","Carpool parking Rotselaar","N19 / N229","Rotselaar","50.938803, 4.736643","2021-11-16","https://api.mapbox.com/styles/v1/heinv/cj1c3sqp500di2rqmtxr5l2jn/static/4.736643,50.938803,13,0/400x400?access_token=pk.eyJ1IjoiaGVpbnYiLCJhIjoiNGEzYjEwYjY5MjM3YjQxNTZlZmY5MjE5YTViZWFiNjYifQ.dwA82fqv0CeVGxFMr30KIg","https://api.mapbox.com/styles/v1/heinv/cj1c3sqp500di2rqmtxr5l2jn/static/","50.938803","4.736643",",13,0/400x400?access_token=pk.eyJ1IjoiaGVpbnYiLCJhIjoiNGEzYjEwYjY5MjM3YjQxNTZlZmY5MjE5YTViZWFiNjYifQ.dwA82fqv0CeVGxFMr30KIg",null,null,null,null,null,81]
[82,"Vuntcomplex","Carpool parking Vuntcomplex","A2 / Vuntcomplex","Leuven","50.906947, 4.716171","2021-11-16","https://api.mapbox.com/styles/v1/heinv/cj1c3sqp500di2rqmtxr5l2jn/static/4.716171,50.906947,13,0/400x400?access_token=pk.eyJ1IjoiaGVpbnYiLCJhIjoiNGEzYjEwYjY5MjM3YjQxNTZlZmY5MjE5YTViZWFiNjYifQ.dwA82fqv0CeVGxFMr30KIg","https://api.mapbox.com/styles/v1/heinv/cj1c3sqp500di2rqmtxr5l2jn/static/","50.906947","4.716171",",13,0/400x400?access_token=pk.eyJ1IjoiaGVpbnYiLCJhIjoiNGEzYjEwYjY5MjM3YjQxNTZlZmY5MjE5YTViZWFiNjYifQ.dwA82fqv0CeVGxFMr30KIg",null,null,null,null,null,82]
[83,"Sterrebeek","Carpool parking Sterrebeek","N227 / A3","Zaventem","50.871388, 4.510603","2021-11-18","https://api.mapbox.com/styles/v1/heinv/cj1c3sqp500di2rqmtxr5l2jn/static/4.510603,50.871388,13,0/400x400?access_token=pk.eyJ1IjoiaGVpbnYiLCJhIjoiNGEzYjEwYjY5MjM3YjQxNTZlZmY5MjE5YTViZWFiNjYifQ.dwA82fqv0CeVGxFMr30KIg","https://api.mapbox.com/styles/v1/heinv/cj1c3sqp500di2rqmtxr5l2jn/static/","50.871388","4.510603",",13,0/400x400?access_token=pk.eyJ1IjoiaGVpbnYiLCJhIjoiNGEzYjEwYjY5MjM3YjQxNTZlZmY5MjE5YTViZWFiNjYifQ.dwA82fqv0CeVGxFMr30KIg",null,null,null,null,null,83]
[84,"Halle-Rattenput","Carpool parking Halle-Rattenput","N6 / A8","Halle","50.723963, 4.227925","2021-11-23","https://api.mapbox.com/styles/v1/heinv/cj1c3sqp500di2rqmtxr5l2jn/static/4.227925,50.723963,13,0/400x400?access_token=pk.eyJ1IjoiaGVpbnYiLCJhIjoiNGEzYjEwYjY5MjM3YjQxNTZlZmY5MjE5YTViZWFiNjYifQ.dwA82fqv0CeVGxFMr30KIg","https://api.mapbox.com/styles/v1/heinv/cj1c3sqp500di2rqmtxr5l2jn/static/","50.723963","4.227925",",13,0/400x400?access_token=pk.eyJ1IjoiaGVpbnYiLCJhIjoiNGEzYjEwYjY5MjM3YjQxNTZlZmY5MjE5YTViZWFiNjYifQ.dwA82fqv0CeVGxFMr30KIg",null,null,null,null,null,84]
[85,"Strombeek-Bever","Carpool parking Strombeek-Bever","N276 / Nieuwelaan","Grimbergen","50.903140, 4.346976","2021-11-18","https://api.mapbox.com/styles/v1/heinv/cj1c3sqp500di2rqmtxr5l2jn/static/4.346976,50.903140,13,0/400x400?access_token=pk.eyJ1IjoiaGVpbnYiLCJhIjoiNGEzYjEwYjY5MjM3YjQxNTZlZmY5MjE5YTViZWFiNjYifQ.dwA82fqv0CeVGxFMr30KIg","https://api.mapbox.com/styles/v1/heinv/cj1c3sqp500di2rqmtxr5l2jn/static/","50.903140","4.346976",",13,0/400x400?access_token=pk.eyJ1IjoiaGVpbnYiLCJhIjoiNGEzYjEwYjY5MjM3YjQxNTZlZmY5MjE5YTViZWFiNjYifQ.dwA82fqv0CeVGxFMr30KIg",null,null,null,null,null,85]
[86,"Jezus-Eik","Carpool parking Jezus-Eik","A4 / Kersenbomenlaan","Overijse","50.791286, 4.486517","2021-11-18","https://api.mapbox.com/styles/v1/heinv/cj1c3sqp500di2rqmtxr5l2jn/static/4.486517,50.791286,13,0/400x400?access_token=pk.eyJ1IjoiaGVpbnYiLCJhIjoiNGEzYjEwYjY5MjM3YjQxNTZlZmY5MjE5YTViZWFiNjYifQ.dwA82fqv0CeVGxFMr30KIg","https://api.mapbox.com/styles/v1/heinv/cj1c3sqp500di2rqmtxr5l2jn/static/","50.791286","4.486517",",13,0/400x400?access_token=pk.eyJ1IjoiaGVpbnYiLCJhIjoiNGEzYjEwYjY5MjM3YjQxNTZlZmY5MjE5YTViZWFiNjYifQ.dwA82fqv0CeVGxFMr30KIg",null,null,null,null,null,86]
[87,"Affligem","Carpool parking Affligem","N208 / A10","Affligem","50.893622, 4.119238","2021-11-23","https://api.mapbox.com/styles/v1/heinv/cj1c3sqp500di2rqmtxr5l2jn/static/4.119238,50.893622,13,0/400x400?access_token=pk.eyJ1IjoiaGVpbnYiLCJhIjoiNGEzYjEwYjY5MjM3YjQxNTZlZmY5MjE5YTViZWFiNjYifQ.dwA82fqv0CeVGxFMr30KIg","https://api.mapbox.com/styles/v1/heinv/cj1c3sqp500di2rqmtxr5l2jn/static/","50.893622","4.119238",",13,0/400x400?access_token=pk.eyJ1IjoiaGVpbnYiLCJhIjoiNGEzYjEwYjY5MjM3YjQxNTZlZmY5MjE5YTViZWFiNjYifQ.dwA82fqv0CeVGxFMr30KIg",null,null,null,null,null,87]
[88,"Bertem","Carpool parking Bertem","N3 / A3","Bertem","50.861791, 4.613666","2021-11-16","https://api.mapbox.com/styles/v1/heinv/cj1c3sqp500di2rqmtxr5l2jn/static/4.613666,50.861791,13,0/400x400?access_token=pk.eyJ1IjoiaGVpbnYiLCJhIjoiNGEzYjEwYjY5MjM3YjQxNTZlZmY5MjE5YTViZWFiNjYifQ.dwA82fqv0CeVGxFMr30KIg","https://api.mapbox.com/styles/v1/heinv/cj1c3sqp500di2rqmtxr5l2jn/static/","50.861791","4.613666",",13,0/400x400?access_token=pk.eyJ1IjoiaGVpbnYiLCJhIjoiNGEzYjEwYjY5MjM3YjQxNTZlZmY5MjE5YTViZWFiNjYifQ.dwA82fqv0CeVGxFMr30KIg",null,null,null,null,null,88]
[89,"Hoegaarden","Carpool parking Hoegaarden","N29 / A3","Hoegaarden","50.780420, 4.919336","2021-11-16","https://api.mapbox.com/styles/v1/heinv/cj1c3sqp500di2rqmtxr5l2jn/static/4.919336,50.780420,13,0/400x400?access_token=pk.eyJ1IjoiaGVpbnYiLCJhIjoiNGEzYjEwYjY5MjM3YjQxNTZlZmY5MjE5YTViZWFiNjYifQ.dwA82fqv0CeVGxFMr30KIg","https://api.mapbox.com/styles/v1/heinv/cj1c3sqp500di2rqmtxr5l2jn/static/","50.780420","4.919336",",13,0/400x400?access_token=pk.eyJ1IjoiaGVpbnYiLCJhIjoiNGEzYjEwYjY5MjM3YjQxNTZlZmY5MjE5YTViZWFiNjYifQ.dwA82fqv0CeVGxFMr30KIg",null,null,null,null,null,89]
[90,"Kampenhout","Carpool parking Kampenhout","N21 / N26","Kampenhout","50.955475, 4.594162","2021-11-16","https://api.mapbox.com/styles/v1/heinv/cj1c3sqp500di2rqmtxr5l2jn/static/4.594162,50.955475,13,0/400x400?access_token=pk.eyJ1IjoiaGVpbnYiLCJhIjoiNGEzYjEwYjY5MjM3YjQxNTZlZmY5MjE5YTViZWFiNjYifQ.dwA82fqv0CeVGxFMr30KIg","https://api.mapbox.com/styles/v1/heinv/cj1c3sqp500di2rqmtxr5l2jn/static/","50.955475","4.594162",",13,0/400x400?access_token=pk.eyJ1IjoiaGVpbnYiLCJhIjoiNGEzYjEwYjY5MjM3YjQxNTZlZmY5MjE5YTViZWFiNjYifQ.dwA82fqv0CeVGxFMr30KIg",null,null,null,null,null,90]
[91,"Nevele","Carpool parking Nevele","N437 / A10","Nevele","51.056514, 3.527934","2021-11-09","https://api.mapbox.com/styles/v1/heinv/cj1c3sqp500di2rqmtxr5l2jn/static/3.527934,51.056514,13,0/400x400?access_token=pk.eyJ1IjoiaGVpbnYiLCJhIjoiNGEzYjEwYjY5MjM3YjQxNTZlZmY5MjE5YTViZWFiNjYifQ.dwA82fqv0CeVGxFMr30KIg","https://api.mapbox.com/styles/v1/heinv/cj1c3sqp500di2rqmtxr5l2jn/static/","51.056514","3.527934",",13,0/400x400?access_token=pk.eyJ1IjoiaGVpbnYiLCJhIjoiNGEzYjEwYjY5MjM3YjQxNTZlZmY5MjE5YTViZWFiNjYifQ.dwA82fqv0CeVGxFMr30KIg",null,null,null,null,null,91]
[92,"Beerse-Vosselaar","P+R parking Beerse-Vosselaar","N132 / A21","Lille","51.289402, 4.856541","2021-11-18","https://api.mapbox.com/styles/v1/heinv/cj1c3sqp500di2rqmtxr5l2jn/static/4.856541,51.289402,13,0/400x400?access_token=pk.eyJ1IjoiaGVpbnYiLCJhIjoiNGEzYjEwYjY5MjM3YjQxNTZlZmY5MjE5YTViZWFiNjYifQ.dwA82fqv0CeVGxFMr30KIg","https://api.mapbox.com/styles/v1/heinv/cj1c3sqp500di2rqmtxr5l2jn/static/","51.289402","4.856541",",13,0/400x400?access_token=pk.eyJ1IjoiaGVpbnYiLCJhIjoiNGEzYjEwYjY5MjM3YjQxNTZlZmY5MjE5YTViZWFiNjYifQ.dwA82fqv0CeVGxFMr30KIg",null,null,null,null,null,92]
[93,"Terlaemen","Carpool parking Terlaemen","N729 / Snelwegstraat","Heusden-Zolder","51.006354, 5.271851","2021-11-18","https://api.mapbox.com/styles/v1/heinv/cj1c3sqp500di2rqmtxr5l2jn/static/5.271851,51.006354,13,0/400x400?access_token=pk.eyJ1IjoiaGVpbnYiLCJhIjoiNGEzYjEwYjY5MjM3YjQxNTZlZmY5MjE5YTViZWFiNjYifQ.dwA82fqv0CeVGxFMr30KIg","https://api.mapbox.com/styles/v1/heinv/cj1c3sqp500di2rqmtxr5l2jn/static/","51.006354","5.271851",",13,0/400x400?access_token=pk.eyJ1IjoiaGVpbnYiLCJhIjoiNGEzYjEwYjY5MjM3YjQxNTZlZmY5MjE5YTViZWFiNjYifQ.dwA82fqv0CeVGxFMr30KIg",null,null,null,null,null,93]
[94,"Boechout","P+R parking Boechout","N10 / Borsbeeksesteenweg","Boechout","51.168563, 4.494312","2021-11-18","https://api.mapbox.com/styles/v1/heinv/cj1c3sqp500di2rqmtxr5l2jn/static/4.494312,51.168563,13,0/400x400?access_token=pk.eyJ1IjoiaGVpbnYiLCJhIjoiNGEzYjEwYjY5MjM3YjQxNTZlZmY5MjE5YTViZWFiNjYifQ.dwA82fqv0CeVGxFMr30KIg","https://api.mapbox.com/styles/v1/heinv/cj1c3sqp500di2rqmtxr5l2jn/static/","51.168563","4.494312",",13,0/400x400?access_token=pk.eyJ1IjoiaGVpbnYiLCJhIjoiNGEzYjEwYjY5MjM3YjQxNTZlZmY5MjE5YTViZWFiNjYifQ.dwA82fqv0CeVGxFMr30KIg",null,null,null,null,null,94]
[95,"Aalter",{"$f":"\"Carpool parking \"&B96","v":"Carpool parking Aalter"},"N37/N409/E40","Aalter",{"$f":"J96&\", \"&K96","v":"51.0749724302438, 3.44756033702165"},"2021-11-09","https://api.mapbox.com/styles/v1/heinv/cj1c3sqp500di2rqmtxr5l2jn/static/3.44756033702165,51.0749724302438,13,0/400x400?access_token=pk.eyJ1IjoiaGVpbnYiLCJhIjoiNGEzYjEwYjY5MjM3YjQxNTZlZmY5MjE5YTViZWFiNjYifQ.dwA82fqv0CeVGxFMr30KIg","https://api.mapbox.com/styles/v1/heinv/cj1c3sqp500di2rqmtxr5l2jn/static/","51.0749724302438","3.44756033702165",",13,0/400x400?access_token=pk.eyJ1IjoiaGVpbnYiLCJhIjoiNGEzYjEwYjY5MjM3YjQxNTZlZmY5MjE5YTViZWFiNjYifQ.dwA82fqv0CeVGxFMr30KIg",null,null,null,null,null,95]
[96,"De Pinte",{"$f":"\"Carpool parking \"&B97","v":"Carpool parking De Pinte"},"E17/N60","De Pinte",{"$f":"J97&\", \"&K97","v":"50.9860214680881, 3.67492574904555"},"2021-11-23","https://api.mapbox.com/styles/v1/heinv/cj1c3sqp500di2rqmtxr5l2jn/static/3.67492574904555,50.9860214680881,13,0/400x400?access_token=pk.eyJ1IjoiaGVpbnYiLCJhIjoiNGEzYjEwYjY5MjM3YjQxNTZlZmY5MjE5YTViZWFiNjYifQ.dwA82fqv0CeVGxFMr30KIg","https://api.mapbox.com/styles/v1/heinv/cj1c3sqp500di2rqmtxr5l2jn/static/","50.9860214680881","3.67492574904555",",13,0/400x400?access_token=pk.eyJ1IjoiaGVpbnYiLCJhIjoiNGEzYjEwYjY5MjM3YjQxNTZlZmY5MjE5YTViZWFiNjYifQ.dwA82fqv0CeVGxFMr30KIg",null,null,null,null,null,96]
[97,"Destelbergen","Carpool parking Destelbergen","R4/N445","Destelbergen","51.0582508416525, 3.81284992030355","2021-11-09","https://api.mapbox.com/styles/v1/heinv/cj1c3sqp500di2rqmtxr5l2jn/static/3.81284992030355,51.0582508416525,13,0/400x400?access_token=pk.eyJ1IjoiaGVpbnYiLCJhIjoiNGEzYjEwYjY5MjM3YjQxNTZlZmY5MjE5YTViZWFiNjYifQ.dwA82fqv0CeVGxFMr30KIg","https://api.mapbox.com/styles/v1/heinv/cj1c3sqp500di2rqmtxr5l2jn/static/","51.0582508416525","3.81284992030355",",13,0/400x400?access_token=pk.eyJ1IjoiaGVpbnYiLCJhIjoiNGEzYjEwYjY5MjM3YjQxNTZlZmY5MjE5YTViZWFiNjYifQ.dwA82fqv0CeVGxFMr30KIg",null,null,null,null,null,97]
[98,"Lokeren","Carpool parking Lokeren","E17/N47 - uitrit 12","Lokeren","51.087592871792, 4.01991671115621","2021-11-09","https://api.mapbox.com/styles/v1/heinv/cj1c3sqp500di2rqmtxr5l2jn/static/4.01991671115621,51.087592871792,13,0/400x400?access_token=pk.eyJ1IjoiaGVpbnYiLCJhIjoiNGEzYjEwYjY5MjM3YjQxNTZlZmY5MjE5YTViZWFiNjYifQ.dwA82fqv0CeVGxFMr30KIg","https://api.mapbox.com/styles/v1/heinv/cj1c3sqp500di2rqmtxr5l2jn/static/","51.087592871792","4.01991671115621",",13,0/400x400?access_token=pk.eyJ1IjoiaGVpbnYiLCJhIjoiNGEzYjEwYjY5MjM3YjQxNTZlZmY5MjE5YTViZWFiNjYifQ.dwA82fqv0CeVGxFMr30KIg",null,null,null,null,null,98]
[99,"Massenhoven",{"$f":"\"P+R parking \"&B100","v":"P+R parking Massenhoven"},"E313/N14","Massenhoven","51.194333453788, 4.64222375753947","2021-11-18","https://api.mapbox.com/styles/v1/heinv/cj1c3sqp500di2rqmtxr5l2jn/static/4.64222375753947,51.194333453788,13,0/400x400?access_token=pk.eyJ1IjoiaGVpbnYiLCJhIjoiNGEzYjEwYjY5MjM3YjQxNTZlZmY5MjE5YTViZWFiNjYifQ.dwA82fqv0CeVGxFMr30KIg","https://api.mapbox.com/styles/v1/heinv/cj1c3sqp500di2rqmtxr5l2jn/static/","51.194333453788","4.64222375753947",",13,0/400x400?access_token=pk.eyJ1IjoiaGVpbnYiLCJhIjoiNGEzYjEwYjY5MjM3YjQxNTZlZmY5MjE5YTViZWFiNjYifQ.dwA82fqv0CeVGxFMr30KIg",null,null,null,null,null,99]
[100,"Tongeren","Carpool parking Tongeren","N79 / E313 (rotonde)","Tongeren","50.7911487169427, 5.52935513780375","2021-11-16",{"$f":"I101&K101&\",\"&J101&L101","v":"https://api.mapbox.com/styles/v1/heinv/cj1c3sqp500di2rqmtxr5l2jn/static/5.52935513780375,50.7911487169427,13,0/400x400?access_token=pk.eyJ1IjoiaGVpbnYiLCJhIjoiNGEzYjEwYjY5MjM3YjQxNTZlZmY5MjE5YTViZWFiNjYifQ.dwA82fqv0CeVGxFMr30KIg"},"https://api.mapbox.com/styles/v1/heinv/cj1c3sqp500di2rqmtxr5l2jn/static/","50.7911487169427","5.52935513780375",",13,0/400x400?access_token=pk.eyJ1IjoiaGVpbnYiLCJhIjoiNGEzYjEwYjY5MjM3YjQxNTZlZmY5MjE5YTViZWFiNjYifQ.dwA82fqv0CeVGxFMr30KIg",null,null,null,null,null,100]

{"sheet":"Sjabloon","index":95,"n_rows":55,"n_cols":27,"rows_kept":55,"cut":false,"hidden":true,"merged":[[4,3,5,12],[15,3,16,12],[4,16,5,16]]}
[]
[null,"PARKEERONDERZOEK",null,"CARPOOLPARKINGS EN P+R PARKINGS"]
[null,1,null,{"$f":"B8 & \" - \"& TEXT(VLOOKUP(B3,Coordinaten!$A$2:$G$95,7,0),\"dddd dd mmmm jjjj\")","v":"Carpool parking Kemzeke-Zuid, Stekene - dinsdag 09 november 2021"}]
[null,{"$f":"VLOOKUP(B3,Coordinaten!$A$2:$G$95,6,0)","v":"51.226907, 4.063425"}]
[null,null,null,"BEZETTING  ",null,null,null,null,null,null,null,null,null,null,null,null,"OPMERKINGEN"]
[]
[null,"Onderzoeksgebied",null,"Datum","Geregistreerd tussen","Pers","Vracht","Losse trekkers","Losse oplegger","Overig","Fout   pers","Fout Vracht","Totaal","Invalidenplaats","Gestalde fietsen",null,null,null,null,null,{"$f":"F7","v":"Pers"},"Vracht","Losse trekkers","Losse oplegger","Overig","Fout   pers","Fout Vracht"]
[null,{"$f":"VLOOKUP(B3,Coordinaten!$A$2:$G$95,3,0)&\", \"&VLOOKUP(B3,Coordinaten!$A$2:$G$95,5,0)","v":"Carpool parking Kemzeke-Zuid, Stekene"},null,null,null,null,null,null,null,null,null,null,null,null,null,null,null,null,{"$f":"D8","v":"00:00:00"},{"$f":"E8","v":0},{"$f":"F8/$M8","v":{"$error":"#DIV/0!"}},{"$error":"#DIV/0!"},{"$error":"#DIV/0!"},{"$error":"#DIV/0!"},{"$error":"#DIV/0!"},{"$error":"#DIV/0!"},{"$error":"#DIV/0!"}]
[null,{"$f":"\"Nabij kruispunt: \"&VLOOKUP(B3,Coordinaten!$A$2:$L$95,4,0)","v":"Nabij kruispunt: N49 / N403"},null,null,null,null,null,null,null,null,null,null,null,null,null,null,null,null,{"$f":"D10","v":"00:00:00"},{"$f":"E10","v":0},{"$f":"F10/$M10","v":{"$error":"#DIV/0!"}},{"$error":"#DIV/0!"},{"$error":"#DIV/0!"},{"$error":"#DIV/0!"},{"$error":"#DIV/0!"},{"$error":"#DIV/0!"},{"$error":"#DIV/0!"}]
[]
[null,"Meting"]
[null,{"$f":"\"Meetperiode: \"&TEXT(VLOOKUP(B3,Coordinaten!$A$2:$G$95,7,0),\"dddd dd mmmm jjjj\")","v":"Meetperiode: dinsdag 09 november 2021"}]
[null,"Methodiek: Parkeerdrukmeting met waarnemers"]
[null,"In opdracht van: Vlaamse overheid"]
[null,"Uitgevoerd door: Dufec"]
[null,null,null,"VERDELING NAAR CATEGORIE"]
[null,"Locatie"]
[null,{"$f":"IF(B4=\"\",\"\",HYPERLINK(\"http://www.googlemaps.com/?q=\"&B4,\"Lat/Long: \"&B4))","v":"Lat/Long: 51.226907, 4.063425"}]
[]
[null,null,null,null,null,null,null,null,null,null,null,null,null,null,null,"Legenda"]
[null,null,null,null,null,null,null,null,null,null,null,null,null,null,null,null,"Personenwagen"]
[null,null,null,null,null,null,null,null,null,null,null,null,null,null,null,null,"Vracht"]
[null,null,null,null,null,null,null,null,null,null,null,null,null,null,null,null,"Losse trekkers"]
[null,null,null,null,null,null,null,null,null,null,null,null,null,null,null,null,"Losse opleggers"]
[null,null,null,null,null,null,null,null,null,null,null,null,null,null,null,null,"Overig"]
[null,null,null,null,null,null,null,null,null,null,null,null,null,null,null,null,"Fout \"Licht\""]
[null,null,null,null,null,null,null,null,null,null,null,null,null,null,null,null,"Fout Vracht"]
[]
[]
[]
[]
[]
[]
[]
[]
[]
[]
[]
[null,"Toelichting"]
[null,"Pers = personenwagens en motoren licht verkeer)"]
[null,"          op daarvoor bestemde openbare plaatsen"]
[null,"Vracht = vrachtwagens op daarvoor bestemde"]
[null,"          parkeerplaatsen (middel- en zwaar vrachtverkeer)"]
[null,"Losse trekkers = geparkeerde vrachtwagencabines"]
[null,"          op gehele parking"]
[null,"Losse opleggers = geparkeerde opleggers op gehele"]
[null,"          parking"]
[null,"Overig = andere voertuigen op de parking"]
[null,"Fout pers = personenwagens en motoren die fout"]
[null,"          geparkeerd staan"]
[null,"Fout vracht = vrachtwagens die fout geparkeerd staan"]
[null,"Invalide = personenwagens en motoren op voor"]
[null,"          invalide personen bestemde parkeerplaats"]
[null,"Gestalde fietsen = alle gestalde fietsen binnen de"]
[null,"          rode lijnen"]